program: Orca
programVersion: 4.2.1
elementType: Cl Cl O O N N N C C C C C C C C C C C C C C C H H H H H H H H H H H H H H H H H
charge: 0
multiplicity: 1
keywords: wb97x-d3
keywords: def2-TZVPP
keywords: def2/J RIJCOSX GRIDX6 NOFINALGRIDX
keywords: grid4 nofinalgrid
keywords: scfconv7
keywords: smallprint printgap noloewdin
keywords: NOSOSCF
formula: C15H17Cl2N3O2
InChI: InChI=1S/C15H17Cl2N3O2/c1-2-3-12-7-21-15(22-12,8-20-10-18-9-19-20)13-5-4-11(16)6-14(13)17/h4-6,9-10,12H,2-3,7-8H2,1H3
39 atoms
Cl 1.625695 1.977355 1.887217
Cl 4.624905 -0.361729 -1.840917
O  -1.542277 -0.937636 0.552269
O  -0.683916 0.162925 2.278418
N  -1.52032 1.51969 -0.99629
N  -0.63565 2.249234 -1.683078
N  -1.992199 1.142643 -3.083268
C  -0.742244 0.160771 0.890139
C  -1.418159 -1.921309 1.573686
C  -0.609951 -1.190828 2.660576
C  -2.794235 -2.373738 2.023242
C  -1.45587 1.436695 0.436564
C  0.635455 0.029664 0.244383
C  -3.631601 -2.997727 0.914114
C  1.730411 0.804162 0.621888
C  0.815673 -0.853766 -0.814822
C  -4.979967 -3.493435 1.415717
C  2.95809 0.685085 -0.010642
C  2.029093 -0.98752 -1.465958
C  -2.317939 0.858605 -1.849274
C  3.09871 -0.214593 -1.051965
C  -0.95695 1.995381 -2.926762
H  -0.856573 -2.77999 1.185526
H  -1.040628 -1.293608 3.657389
H  0.428225 -1.539177 2.692814
H  -3.325787 -1.523596 2.464553
H  -2.660737 -3.104149 2.828596
H  -0.927449 2.316731 0.795635
H  -2.463327 1.443463 0.855231
H  -3.079188 -3.829792 0.466817
H  -3.783009 -2.269838 0.114187
H  -0.0208 -1.44978 -1.150807
H  -4.862621 -4.263766 2.179467
H  -5.562736 -2.682609 1.855511
H  -5.572055 -3.921146 0.607045
H  3.791515 1.296566 0.303971
H  2.136186 -1.680342 -2.288306
H  -3.107313 0.197606 -1.528072
H  -0.428864 2.444765 -3.7527
totalener: -1817.01865220 hartree
nucrepener: 2188.33294222 hartree
electener: -4005.35159442 hartree
oneelecener: -6841.96295882 hartree
twoeener: 2836.61136440 hartree
kineticenergy: 1811.92550283 hartree
xcener: -128.814098376523 hartree
chargesum: -0.0000000
charge: -0.057926 -0.067824 -0.376718 -0.316906 0.110581 -0.303806 -0.327921 0.567799 0.110458 0.012358 -0.178221 -0.102587 -0.166370 -0.071923 0.005627 -0.106214 -0.259580 -0.144942 -0.183899 0.036943 0.120696 0.062354 0.081149 0.091075 0.084994 0.070613 0.064143 0.131759 0.111853 0.052398 0.066116 0.139805 0.074673 0.075020 0.089232 0.110719 0.123948 0.139417 0.131107
qa: -0.0579 -0.0678 -0.3767 -0.3169 0.1106 -0.3038 -0.3279 0.5678 0.1105 0.0124 -0.1782 -0.1026 -0.1664 -0.0719 0.0056 -0.1062 -0.2596 -0.1449 -0.1839 0.0369 0.1207 0.0624 0.0811 0.0911 0.0850 0.0706 0.0641 0.1318 0.1119 0.0524 0.0661 0.1398 0.0747 0.0750 0.0892 0.1107 0.1239 0.1394 0.1311
va: 1.2662 1.2375 1.9907 2.0513 3.3204 2.8545 3.0658 3.8790 3.8669 3.9726 3.9525 3.8444 3.6205 3.8713 4.0202 3.8878 3.9504 4.0909 4.1093 4.0971 3.9177 4.0429 0.9987 0.9952 0.9997 1.0157 1.0137 1.0307 1.0216 1.0109 1.0179 1.0199 1.0026 1.0028 1.0058 1.0281 1.0138 1.0082 1.0019
dispcorr: -0.022402517 hartree
energy: -1817.041054720096
dipole: -38.01980 37.41388 -0.60593 -23.15944 21.93985 -1.21959 10.16563 -8.92030 1.24533
magnitude: 1.84537 au
magnitude: 4.69057 debye
