program: Orca
programVersion: 4.2.1
elementType: Cl Cl O O N N N C C C C C C C C C C C C C C C H H H H H H H H H H H H H H H H H
charge: 0
multiplicity: 1
keywords: wb97x-d3
keywords: def2-TZVPP
keywords: def2/J RIJCOSX GRIDX6 NOFINALGRIDX
keywords: grid4 nofinalgrid
keywords: scfconv7
keywords: smallprint printgap noloewdin
keywords: NOSOSCF
formula: C15H17Cl2N3O2
InChI: InChI=1S/C15H17Cl2N3O2/c1-2-3-12-7-21-15(22-12,8-20-10-18-9-19-20)13-5-4-11(16)6-14(13)17/h4-6,9-10,12H,2-3,7-8H2,1H3
39 atoms
Cl 2.036545 -0.613251 -2.193236
Cl 0.863523 -5.42106 -0.229297
O  -0.755064 0.89572 1.02519
O  -0.061176 1.174661 -1.086742
N  1.407298 2.628538 0.876694
N  1.12806 3.116057 2.08928
N  1.035842 4.744716 0.547821
C  0.278619 0.587812 0.13328
C  -1.856431 1.468371 0.31892
C  -1.473943 1.228689 -1.13419
C  -3.164732 0.828011 0.731447
C  1.577493 1.218226 0.647727
C  0.434786 -0.926534 0.0080
C  -4.354643 1.46897 0.025338
C  1.197374 -1.533703 -0.989417
C  -0.178697 -1.763885 0.935136
C  -5.676633 0.83896 0.434017
C  1.332555 -2.911638 -1.071241
C  -0.059451 -3.14204 0.87904
C  1.334124 3.606225 -0.028185
C  0.697948 -3.704718 -0.131961
C  0.919048 4.381147 1.839595
H  -1.883355 2.543653 0.535526
H  -1.893809 0.287482 -1.512198
H  -1.76889 2.035275 -1.802932
H  -3.291785 0.922891 1.813443
H  -3.129524 -0.243021 0.505959
H  2.389454 1.065454 -0.060703
H  1.871661 0.754339 1.58674
H  -4.237877 1.384182 -1.059415
H  -4.374288 2.540022 0.246448
H  -0.772018 -1.334119 1.728831
H  -6.516969 1.320052 -0.067485
H  -5.705603 -0.222106 0.179959
H  -5.841674 0.924803 1.509539
H  1.92605 -3.355217 -1.858381
H  -0.553343 -3.760055 1.615448
H  1.527657 3.456084 -1.077926
H  0.681075 5.077874 2.628014
elementType: Cl O N C H
totalener: -1817.03580322 hartree
nucrepener: 2150.32757364 hartree
electener: -3967.36337687 hartree
oneelecener: -6765.79356061 hartree
twoeener: 2798.43018374 hartree
cpcmener: -0.02652802 hartree
kineticenergy: 1811.93721506 hartree
xcener: -128.819460037449 hartree
chargesum: 0.0000000
charge: -0.076096 -0.083517 -0.397233 -0.372620 0.124336 -0.355356 -0.415985 0.572091 0.136975 0.008052 -0.156622 -0.109013 -0.093521 -0.083401 -0.015231 -0.155364 -0.286302 -0.151660 -0.184981 0.064715 0.116671 0.055256 0.085334 0.092110 0.122085 0.076456 0.064904 0.149030 0.129959 0.066206 0.066772 0.155632 0.091897 0.080630 0.081343 0.122480 0.147898 0.164016 0.162056
qa: -0.0761 -0.0835 -0.3972 -0.3726 0.1243 -0.3554 -0.4160 0.5721 0.1370 0.0081 -0.1566 -0.1090 -0.0935 -0.0834 -0.0152 -0.1554 -0.2863 -0.1517 -0.1850 0.0647 0.1167 0.0553 0.0853 0.0921 0.1221 0.0765 0.0649 0.1490 0.1300 0.0662 0.0668 0.1556 0.0919 0.0806 0.0813 0.1225 0.1479 0.1640 0.1621
va: 1.2440 1.2207 1.9973 1.9869 3.3766 2.8870 3.0266 3.8884 3.9262 3.8988 3.9640 3.7903 3.5383 3.8742 4.0107 3.9537 3.9490 4.0856 4.0584 4.0744 3.8574 4.0534 1.0023 1.0022 0.9925 1.0135 1.0090 1.0165 1.0218 1.0072 1.0080 1.0215 1.0028 1.0006 1.0002 1.0257 1.0065 1.0092 0.9953
dispcorr: -0.021425804 hartree
energy: -1817.057229026566
dipole: -33.50396 32.40161 -1.10235 20.78176 -21.86432 -1.08256 7.93575 -8.42902 -0.49326
magnitude: 1.62186 au
magnitude: 4.12243 debye
