program: Orca
programVersion: 4.2.1
elementType: Cl Cl O O N N N C C C C C C C C C C C C C C C H H H H H H H H H H H H H H H H H
charge: 0
multiplicity: 1
keywords: wb97x-d3
keywords: def2-TZVPP
keywords: def2/J RIJCOSX GRIDX6 NOFINALGRIDX
keywords: grid4 nofinalgrid
keywords: scfconv7
keywords: smallprint printgap noloewdin
keywords: NOSOSCF
formula: C15H17Cl2N3O2
InChI: InChI=1S/C15H17Cl2N3O2/c1-2-3-12-7-21-15(22-12,8-20-10-18-9-19-20)13-5-4-11(16)6-14(13)17/h4-6,9-10,12H,2-3,7-8H2,1H3
39 atoms
Cl -0.016538 -0.917268 2.417269
Cl 0.447057 -5.247175 -0.648275
O  -0.556534 1.288776 0.566216
O  0.325925 1.343483 -1.468293
N  1.902807 2.689311 0.454551
N  2.41244 3.427087 -0.536634
N  1.569713 4.745878 1.072619
C  0.49231 0.78505 -0.200382
C  -1.679826 1.5016 -0.285204
C  -1.071254 1.426826 -1.69575
C  -2.779898 0.484018 -0.041379
C  1.826424 1.255616 0.378778
C  0.474749 -0.743365 -0.269992
C  -4.030097 0.783299 -0.860339
C  0.247164 -1.563984 0.833278
C  0.726637 -1.370068 -1.487086
C  -5.116597 -0.259543 -0.64919
C  0.235251 -2.946822 0.725905
C  0.723759 -2.747539 -1.623691
C  1.396379 3.487697 1.39476
C  0.468675 -3.525616 -0.508821
C  2.193664 4.644721 -0.117091
H  -2.057348 2.505869 -0.073124
H  -1.431491 0.549181 -2.245029
H  -1.271203 2.312579 -2.297038
H  -3.035223 0.480576 1.02174
H  -2.414773 -0.519857 -0.282196
H  2.64708 0.896544 -0.239187
H  1.967404 0.843841 1.377162
H  -3.780569 0.830991 -1.924839
H  -4.410926 1.773178 -0.59304
H  0.928032 -0.769461 -2.362842
H  -6.001689 -0.040796 -1.247072
H  -4.767202 -1.254802 -0.929808
H  -5.426928 -0.303088 0.396291
H  0.047655 -3.559381 1.596587
H  0.916959 -3.198806 -2.586568
H  0.935642 3.117553 2.296273
H  2.504668 5.501818 -0.693351
elementType: Cl O N C H
totalener: -1817.03496553 hartree
nucrepener: 2172.21657213 hartree
electener: -3989.25153765 hartree
oneelecener: -6809.55672103 hartree
twoeener: 2820.30518338 hartree
cpcmener: -0.02803410 hartree
kineticenergy: 1811.93358163 hartree
xcener: -128.819528728647 hartree
chargesum: 0.0000000
charge: -0.074714 -0.083451 -0.383965 -0.382458 0.129857 -0.359024 -0.423496 0.606957 0.242593 -0.062857 -0.187463 -0.110437 -0.175268 -0.092711 -0.021180 -0.134449 -0.281833 -0.135982 -0.188921 0.070899 0.115135 0.059787 0.099449 0.096823 0.119880 0.069543 0.065179 0.132657 0.148577 0.065467 0.069561 0.152435 0.092796 0.080356 0.081320 0.121973 0.148734 0.165479 0.162754
qa: -0.0747 -0.0835 -0.3840 -0.3825 0.1299 -0.3590 -0.4235 0.6070 0.2426 -0.0629 -0.1875 -0.1104 -0.1753 -0.0927 -0.0212 -0.1344 -0.2818 -0.1360 -0.1889 0.0709 0.1151 0.0598 0.0994 0.0968 0.1199 0.0695 0.0652 0.1327 0.1486 0.0655 0.0696 0.1524 0.0928 0.0804 0.0813 0.1220 0.1487 0.1655 0.1628
va: 1.2413 1.2206 1.9957 1.9914 3.3572 2.8928 3.0267 3.8407 3.8005 3.9444 3.9955 3.7792 3.5503 3.8774 3.9875 3.9404 3.9420 4.0765 4.0500 4.0686 3.8578 4.0545 1.0011 0.9945 0.9960 1.0210 1.0005 1.0224 1.0115 1.0102 1.0085 1.0210 1.0032 1.0013 1.0006 1.0262 1.0056 1.0050 0.9947
dispcorr: -0.021964588 hartree
energy: -1817.056930114561
dipole: -23.61182 22.49286 -1.11896 16.99108 -18.33725 -1.34616 -10.63984 10.03806 -0.60178
magnitude: 1.85105 au
magnitude: 4.70499 debye
