program: Orca
programVersion: 4.2.1
elementType: Cl Cl O O N N N C C C C C C C C C C C C C C C H H H H H H H H H H H H H H H H H
charge: 0
multiplicity: 1
keywords: wb97x-d3
keywords: def2-TZVPP
keywords: def2/J RIJCOSX GRIDX6 NOFINALGRIDX
keywords: grid4 nofinalgrid
keywords: scfconv7
keywords: smallprint printgap noloewdin
keywords: NOSOSCF
formula: C15H17Cl2N3O2
InChI: InChI=1S/C15H17Cl2N3O2/c1-2-3-12-7-21-15(22-12,8-20-10-18-9-19-20)13-5-4-11(16)6-14(13)17/h4-6,9-10,12H,2-3,7-8H2,1H3
39 atoms
Cl -0.330752 -0.909221 2.2731
Cl 0.252891 -5.183423 -0.848725
O  -0.656901 1.346315 0.339665
O  0.607028 1.425282 -1.486284
N  1.874289 2.674442 0.646073
N  2.731451 3.314121 -0.153784
N  1.541487 4.782108 1.055981
C  0.505792 0.828958 -0.228926
C  -1.592052 1.603474 -0.706058
C  -0.709719 1.649853 -1.963797
C  -2.686565 0.555416 -0.792207
C  1.720716 1.244468 0.601077
C  0.448212 -0.695399 -0.344038
C  -3.546289 0.440289 0.458323
C  0.070562 -1.530418 0.706557
C  0.793282 -1.305343 -1.546181
C  -4.612339 -0.635234 0.318635
C  0.008903 -2.907975 0.561438
C  0.738645 -2.677647 -1.721308
C  1.1670 3.560442 1.347605
C  0.338344 -3.46872 -0.659902
C  2.498431 4.566721 0.13431
H  -2.036758 2.579702 -0.497273
H  -1.000455 0.881287 -2.687303
H  -0.736015 2.617722 -2.46335
H  -2.249415 -0.418429 -1.037645
H  -3.318957 0.824567 -1.645045
H  2.625652 0.822657 0.168503
H  1.63664 0.861044 1.616026
H  -4.019409 1.404683 0.666078
H  -2.9155 0.213652 1.320263
H  1.111689 -0.6967 -2.380482
H  -5.275206 -0.434127 -0.525142
H  -4.162814 -1.616813 0.155912
H  -5.231534 -0.703309 1.213871
H  -0.291817 -3.530609 1.392221
H  1.00504 -3.114954 -2.673078
H  0.416558 3.280081 2.068505
H  3.046787 5.364743 -0.341089
elementType: Cl O N C H
totalener: -1817.03492904 hartree
nucrepener: 2192.19422876 hartree
electener: -4009.22915780 hartree
oneelecener: -6849.47041721 hartree
twoeener: 2840.24125941 hartree
cpcmener: -0.02754217 hartree
kineticenergy: 1811.94446705 hartree
xcener: -128.822184581975 hartree
chargesum: -0.0000000
charge: -0.080673 -0.083062 -0.384639 -0.385664 0.124517 -0.358209 -0.422901 0.590033 0.251671 -0.049903 -0.224586 -0.110509 -0.160823 -0.094425 -0.008961 -0.125715 -0.281071 -0.145705 -0.187021 0.074259 0.117220 0.056338 0.102517 0.099151 0.108860 0.068079 0.096899 0.129646 0.153979 0.067381 0.060264 0.152687 0.080992 0.078498 0.092251 0.122627 0.148624 0.164577 0.162799
qa: -0.0807 -0.0831 -0.3846 -0.3857 0.1245 -0.3582 -0.4229 0.5900 0.2517 -0.0499 -0.2246 -0.1105 -0.1608 -0.0944 -0.0090 -0.1257 -0.2811 -0.1457 -0.1870 0.0743 0.1172 0.0563 0.1025 0.0992 0.1089 0.0681 0.0969 0.1296 0.1540 0.0674 0.0603 0.1527 0.0810 0.0785 0.0923 0.1226 0.1486 0.1646 0.1628
va: 1.2357 1.2212 1.9876 1.9863 3.3617 2.8860 3.0263 3.8500 3.7679 3.9653 3.9553 3.7681 3.5393 3.8532 3.9753 3.9349 3.9440 4.0857 4.0536 4.0680 3.8563 4.0594 0.9973 0.9954 1.0003 0.9992 1.0124 1.0240 1.0142 1.0088 1.0266 1.0199 1.0014 1.0007 1.0038 1.0255 1.0057 1.0076 0.9947
dispcorr: -0.022786540 hartree
energy: -1817.057715576388
dipole: -20.03786 18.84441 -1.19346 16.00571 -17.24161 -1.23589 -7.30132 6.53056 -0.77076
magnitude: 1.88304 au
magnitude: 4.78631 debye
