program: Orca
programVersion: 4.2.1
elementType: Cl Cl O O N N N C C C C C C C C C C C C C C C H H H H H H H H H H H H H H H H H
charge: 0
multiplicity: 1
keywords: wb97x-d3
keywords: def2-TZVPP
keywords: def2/J RIJCOSX GRIDX6 NOFINALGRIDX
keywords: grid4 nofinalgrid
keywords: scfconv7
keywords: smallprint printgap noloewdin
keywords: NOSOSCF
formula: C15H17Cl2N3O2
InChI: InChI=1S/C15H17Cl2N3O2/c1-2-3-12-7-21-15(22-12,8-20-10-18-9-19-20)13-5-4-11(16)6-14(13)17/h4-6,9-10,12H,2-3,7-8H2,1H3
39 atoms
Cl -0.689702 -0.4396 2.468109
Cl 1.746128 -4.132364 -0.495683
O  -1.814572 1.495539 0.501361
O  -0.615609 1.997936 -1.333236
N  1.762561 2.184369 0.492895
N  2.288371 2.726108 -0.609004
N  3.767217 1.350789 0.372426
C  -0.528606 1.454684 -0.042341
C  -2.750259 1.567219 -0.574116
C  -1.961779 2.375533 -1.590074
C  -3.185496 0.201021 -1.079588
C  0.373922 2.33899 0.837005
C  0.023653 0.032663 -0.134418
C  -3.826809 -0.677267 -0.014056
C  -0.015165 -0.866759 0.928978
C  0.64503 -0.396295 -1.303824
C  -4.226375 -2.039411 -0.560135
C  0.504686 -2.148519 0.827318
C  1.180521 -1.66603 -1.431507
C  2.648664 1.359081 1.052561
C  1.097133 -2.536996 -0.360349
C  3.485217 2.201074 -0.632148
H  -3.616572 2.118912 -0.203526
H  -2.209059 2.132986 -2.623944
H  -2.09373 3.451184 -1.442081
H  -2.340885 -0.325852 -1.535531
H  -3.903584 0.373791 -1.887262
H  0.261005 2.078116 1.887224
H  0.086607 3.383466 0.722658
H  -4.707842 -0.170935 0.391937
H  -3.137814 -0.811863 0.82247
H  0.710885 0.272272 -2.149147
H  -4.695128 -2.655294 0.208132
H  -4.934211 -1.947848 -1.38598
H  -3.357071 -2.585104 -0.93247
H  0.449936 -2.827578 1.666752
H  1.65244 -1.964775 -2.356767
H  2.448331 0.807857 1.95796
H  4.193396 2.450844 -1.406575
elementType: Cl O N C H
totalener: -1817.03318365 hartree
nucrepener: 2243.17276758 hartree
electener: -4060.20595123 hartree
oneelecener: -6952.09981681 hartree
twoeener: 2891.89386558 hartree
cpcmener: -0.02863144 hartree
kineticenergy: 1811.93810101 hartree
xcener: -128.822136421441 hartree
chargesum: -0.0000000
charge: -0.077201 -0.083456 -0.382749 -0.396685 0.133729 -0.351656 -0.402356 0.563888 0.203872 0.009351 -0.214752 -0.142734 -0.044524 -0.096073 -0.086631 -0.170698 -0.280302 -0.099557 -0.155161 0.062185 0.097555 0.056641 0.111509 0.094998 0.092418 0.078487 0.092386 0.141872 0.124124 0.069532 0.057503 0.143548 0.092508 0.082124 0.077785 0.120746 0.149446 0.166890 0.161437
qa: -0.0772 -0.0835 -0.3827 -0.3967 0.1337 -0.3517 -0.4024 0.5639 0.2039 0.0094 -0.2148 -0.1427 -0.0445 -0.0961 -0.0866 -0.1707 -0.2803 -0.0996 -0.1552 0.0622 0.0976 0.0566 0.1115 0.0950 0.0924 0.0785 0.0924 0.1419 0.1241 0.0695 0.0575 0.1435 0.0925 0.0821 0.0778 0.1207 0.1494 0.1669 0.1614
va: 1.2367 1.2204 2.0080 1.9709 3.3356 2.8928 3.0290 3.8540 3.8828 3.9948 3.9302 3.9060 3.4508 3.8688 3.9576 3.8917 3.9475 4.0540 4.0393 4.0692 3.8718 4.0593 0.9937 0.9917 0.9969 0.9981 1.0126 1.0091 1.0190 1.0084 1.0241 1.0346 1.0034 1.0014 1.0006 1.0235 1.0028 0.9985 0.9965
dispcorr: -0.024503271 hartree
energy: -1817.057686921028
dipole: -25.20944 23.01794 -2.19151 9.78022 -9.37458 0.40564 -10.52666 10.27868 -0.24799
magnitude: 2.24249 au
magnitude: 5.69994 debye
