program: Gaussian 09
title: 000030613
version: EM64L-G09RevD.01
frameworkgroup: C1[X(C12H17NO2)]
method: RPBEPBE
basis: SDD
operation: Freq
keyword: #p
keyword: freq=noraman
keyword: PBEPBE/SDD
title: #p freq=noraman PBEPBE/SDD
converged: YES YES NO NO
title: Mulliken charges:
elementType: O O N C C C C C C C C C C C C H H H H H H H H H H H H H H H H H
charge: -0.288984 -0.261463 -0.306451 -0.048622 -0.431699 -0.324177 -0.320634 0.232289 0.249992 -0.378012 -0.371040 -0.378502 -0.678139 -0.228147 -0.226013 0.228505 0.214240 0.224363 0.254335 0.211454 0.244131 0.177890 0.208243 0.219688 0.186873 0.247013 0.247854 0.209112 0.210336 0.221247 0.226981 0.227338
chargesum: 0.00000
title: Mulliken charges with hydrogens summed into heavy atoms:
elementType: O O N C C C C C C C C C C C C
charge: -0.288984 -0.261463 -0.062320 0.179884 0.006903 0.141612 0.065499 0.232289 0.249992 0.028549 -0.124027 -0.130647 -0.037445 -0.001166 0.001325
polarizability: 2.08218075e+02 -4.77571670e+00 1.31558913e+02 -3.17140055e+00 -1.47342355e+00 8.77866889e+01
1716.lowfreq: -8.5145 -3.8615 -0.0011 -0.0008 -0.0004 7.3011 25.3717 35.0094 53.6138
frequency: 25.2779 34.8705 53.5743 89.3628 117.7605 135.6371 152.6376 180.9091 212.9627 219.7973 246.0207 292.8872 326.1140 378.4717 433.0785 447.7599 451.1397 496.7820 515.8760 550.8304 579.0190 649.7594 696.4458 712.2902 721.9269 753.6413 756.7237 816.8401 846.6937 852.9493 885.6977 895.5169 912.3561 931.2541 964.6007 977.2319 1003.7688 1024.7767 1050.4121 1062.1684 1069.3789 1083.5995 1120.1021 1138.1106 1144.3727 1160.2941 1160.5378 1167.5128 1201.6081 1218.9866 1235.9359 1250.7214 1266.9885 1281.7336 1290.2354 1312.7816 1313.6299 1351.1913 1361.8956 1385.3230 1389.8669 1393.2801 1442.6522 1455.6563 1461.2907 1472.2162 1474.6112 1477.9865 1481.2208 1485.7451 1496.4721 1589.4111 1612.3809 2859.8549 2902.2730 2966.4225 2969.6177 2976.8553 2993.5329 2998.3031 3026.6088 3037.2609 3073.4135 3079.0248 3123.7250 3135.8604 3149.3994 3161.8921 3174.1670 3419.2782
redmass: 3.9593 3.6330 1.8532 3.8841 2.9347 2.4097 2.8808 3.2524 4.6988 1.1590 3.3078 4.9311 3.1802 3.6299 3.1944 4.5013 3.2359 4.7920 5.8398 4.1174 5.5544 3.6826 1.3514 4.3526 4.7214 1.2369 1.0792 5.4993 1.4494 2.3779 1.2137 1.8147 2.0053 1.3674 1.2901 6.6681 2.9236 2.0174 2.5762 2.0573 2.0952 2.4838 1.9259 1.7525 3.4403 1.5401 1.2596 2.4628 1.3673 1.4015 2.6524 1.3038 1.4372 1.1127 1.1931 1.2922 1.3233 1.3945 1.7181 1.4663 2.9167 1.5308 2.3473 1.2084 1.2053 1.0616 2.4789 1.0430 1.0749 1.0801 1.0849 7.4866 7.0785 1.0710 1.0695 1.0827 1.0650 1.0364 1.0687 1.0848 1.0904 1.0985 1.1009 1.0992 1.0981 1.0851 1.0897 1.0947 1.1006 1.0738
irintensity: 0.1791 0.0349 0.6279 2.4545 4.2496 0.2705 5.8168 1.6006 0.8374 0.2929 1.7953 0.7762 2.1580 5.6417 5.2134 5.5056 3.8119 1.7493 1.0474 0.9458 2.3109 6.7311 91.3522 0.2997 19.9376 108.0878 8.7098 19.5324 1.2617 18.7634 1.3803 5.9736 1.9370 5.7934 0.0068 50.5158 4.1226 14.8559 33.6509 45.4088 13.1153 29.0710 2.8241 0.9643 48.5060 21.7356 1.1693 4.3636 1.3237 3.9489 303.9868 8.7892 3.5000 0.9544 3.7450 4.5271 6.1604 0.4752 17.5376 5.0809 7.5829 24.9368 4.8655 48.3973 13.5306 7.0721 166.6370 13.1852 4.3584 3.6784 10.8964 25.4727 4.3031 104.4933 74.9430 26.1212 29.7556 34.8339 38.5662 39.4695 41.1169 14.4019 76.7966 46.9312 10.3396 1.2560 13.1433 16.2612 16.1011 1.2133
temp: 298.150 k
press: 1.00000 atm
elementType: 8 8 7 6 6 6 6 6 6 6 6 6 6 6 6 1 1 1 1 1 1 1 1 1 1 1 1 1 1 1 1 1
symmnumber: 1
zpe: 707298.3 jmol-1
zpe.correction: 0.269396 hartree
zpe.thermalcorrener: 0.284151 hartree
zpe.thermalcorrenthalpy: 0.285095 hartree
zpe.thermalcorrgfe: 0.226135 hartree
zpe.sumelectzpe: -671.497742 hartree
zpe.sumelectthermal: -671.482987 hartree
zpe.sumelectthermalent: -671.482043 hartree
zpe.sumelectthermalfe: -671.541002 hartree
dipole: -2.6224 -0.7538 -0.3331
dipole: 2.7489
quadrupole: -80.1622 -92.1557 -90.3008
quadrupole: 0.2418 1.0921 0.9166
quadrupole: 7.3773 -4.6161 -2.7612 0.2418 1.0921 0.9166
hfenergy: -671.7671374 hartree
pointgroup: C01 [X(C12H17N1O2)]
dipole: -1.0303448 -0.291279 -0.1522421 debye
polarizability: 208.2663536|-4.3001447|131.5385335|-3.1585515|1.2824152|87.7587899 unknown
InChI: InChI=1S/C12H17NO2/c1-2-7-13-8-10-9-14-11-5-3-4-6-12(11)15-10/h3-6,10,13H,2,7-9H2,1H3
charge 0 multiplicity 1
32 atoms
O  0.683498 -1.172899 -0.007254
O  1.129805 1.717396 0.134334
N  -2.854779 -0.048405 -0.371269
C  -0.392526 -0.185821 -0.283272
C  -1.714572 -0.883889 0.061353
C  -0.14449 1.083132 0.539805
C  -4.174488 -0.477963 0.147194
C  1.982189 -0.610011 -0.004895
C  2.199124 0.795981 0.047375
C  -5.29601 0.452304 -0.354676
C  3.081963 -1.4903 -0.061805
C  3.51257 1.307005 0.010119
C  -6.687093 0.029715 0.164231
C  4.39643 -0.976052 -0.085429
C  4.611524 0.423916 -0.060471
H  -0.352952 0.070993 -1.363642
H  -1.777089 -1.01971 1.158182
H  -1.696055 -1.905008 -0.388119
H  -0.932513 1.827207 0.354945
H  -0.100868 0.832214 1.618651
H  -2.879295 0.051793 -1.396917
H  -4.42343 -1.534214 -0.128818
H  -4.13442 -0.441068 1.254167
H  -5.064593 1.487188 -0.039022
H  -5.300888 0.452782 -1.464912
H  2.886875 -2.566974 -0.095454
H  3.64968 2.3924 0.046892
H  -6.943662 -0.994319 -0.166506
H  -6.720406 0.044731 1.269845
H  -7.474364 0.711097 -0.205145
H  5.246506 -1.664728 -0.130168
H  5.629328 0.826605 -0.088017
