program: Orca
programVersion: 4.2.1
elementType: Cl Cl O O N N N C C C C C C C C C C C C C C C H H H H H H H H H H H H H H H H H
charge: 0
multiplicity: 1
keywords: wb97x-d3
keywords: def2-TZVPP
keywords: def2/J RIJCOSX GRIDX6 NOFINALGRIDX
keywords: grid4 nofinalgrid
keywords: scfconv7
keywords: smallprint printgap noloewdin
keywords: NOSOSCF
formula: C15H17Cl2N3O2
InChI: InChI=1S/C15H17Cl2N3O2/c1-2-3-12-7-21-15(22-12,8-20-10-18-9-19-20)13-5-4-11(16)6-14(13)17/h4-6,9-10,12H,2-3,7-8H2,1H3
39 atoms
Cl -0.751125 -0.476447 2.409577
Cl 1.702131 -4.138544 -0.57771
O  -1.791449 1.516995 0.418231
O  -0.488241 2.09417 -1.298632
N  1.783686 2.236074 0.527964
N  2.60383 1.369133 1.129215
N  3.628872 2.337706 -0.615776
C  -0.476076 1.478528 -0.040827
C  -2.656836 1.432059 -0.713395
C  -1.798794 2.015622 -1.842543
C  -3.143248 0.022314 -1.006215
C  0.392802 2.332978 0.891442
C  0.060621 0.051549 -0.150542
C  -3.912246 -0.630283 0.132365
C  -0.033077 -0.876362 0.884362
C  0.713251 -0.355181 -1.309395
C  -4.400873 -2.021385 -0.239148
C  0.462136 -2.164854 0.762225
C  1.225516 -1.633122 -1.458351
C  2.404284 2.792479 -0.514107
C  1.086095 -2.531951 -0.417063
C  3.691396 1.471248 0.413208
H  -3.515558 2.070878 -0.496224
H  -1.807315 1.381869 -2.732674
H  -2.117727 3.017399 -2.131317
H  -2.305533 -0.616817 -1.303067
H  -3.791036 0.094136 -1.886501
H  0.295022 2.015392 1.925935
H  0.07338 3.372862 0.826732
H  -4.764308 -0.001639 0.40694
H  -3.278592 -0.694161 1.018701
H  0.826746 0.338601 -2.129942
H  -5.076283 -1.991757 -1.096014
H  -3.566843 -2.674701 -0.502325
H  -4.936676 -2.491055 0.586403
H  0.366651 -2.866477 1.579125
H  1.723186 -1.915394 -2.375185
H  1.943035 3.529527 -1.150949
H  4.574631 0.897832 0.646128
elementType: Cl O N C H
totalener: -1817.03311901 hartree
nucrepener: 2240.71256295 hartree
electener: -4057.74568196 hartree
oneelecener: -6947.29831116 hartree
twoeener: 2889.55262921 hartree
cpcmener: -0.02704116 hartree
kineticenergy: 1811.94163752 hartree
xcener: -128.822871912427 hartree
chargesum: 0.0000000
charge: -0.081574 -0.084908 -0.385832 -0.400004 0.113275 -0.339722 -0.409869 0.588576 0.245705 -0.039847 -0.231372 -0.090553 -0.157900 -0.096988 -0.013541 -0.122879 -0.279175 -0.133158 -0.186780 0.061615 0.116919 0.058654 0.107377 0.095207 0.102149 0.075165 0.093872 0.132417 0.132747 0.068541 0.060756 0.150183 0.081861 0.077467 0.092023 0.120230 0.148439 0.169657 0.161269
qa: -0.0816 -0.0849 -0.3858 -0.4000 0.1133 -0.3397 -0.4099 0.5886 0.2457 -0.0398 -0.2314 -0.0906 -0.1579 -0.0970 -0.0135 -0.1229 -0.2792 -0.1332 -0.1868 0.0616 0.1169 0.0587 0.1074 0.0952 0.1021 0.0752 0.0939 0.1324 0.1327 0.0685 0.0608 0.1502 0.0819 0.0775 0.0920 0.1202 0.1484 0.1697 0.1613
va: 1.2356 1.2190 2.0063 1.9602 3.3629 2.8826 3.0314 3.8242 3.8265 3.9904 3.9261 3.8345 3.5279 3.8623 3.9413 3.8580 3.9455 4.0873 4.0750 4.0700 3.8513 4.0465 0.9933 0.9918 0.9969 0.9988 1.0130 1.0270 1.0194 1.0089 1.0284 1.0222 1.0014 1.0007 1.0038 1.0249 1.0046 1.0075 0.9963
dispcorr: -0.024329388 hartree
energy: -1817.057448393236
dipole: -25.33864 23.11486 -2.22378 9.62923 -8.83965 0.78958 -10.78261 9.62633 -1.15628
magnitude: 2.62785 au
magnitude: 6.67947 debye
