program: Orca
programVersion: 4.2.1
elementType: Cl Cl O O N N N C C C C C C C C C C C C C C C H H H H H H H H H H H H H H H H H
charge: 0
multiplicity: 1
keywords: wb97x-d3
keywords: def2-TZVPP
keywords: def2/J RIJCOSX GRIDX6 NOFINALGRIDX
keywords: grid4 nofinalgrid
keywords: scfconv7
keywords: smallprint printgap noloewdin
keywords: NOSOSCF
formula: C15H17Cl2N3O2
InChI: InChI=1S/C15H17Cl2N3O2/c1-2-3-12-7-21-15(22-12,8-20-10-18-9-19-20)13-5-4-11(16)6-14(13)17/h4-6,9-10,12H,2-3,7-8H2,1H3
39 atoms
Cl 0.477759 -1.184125 2.384332
Cl 1.261388 -5.397191 -0.779827
O  -0.717825 0.839937 0.631095
O  -0.009762 1.09883 -1.479629
N  1.442329 2.647676 0.394611
N  1.707192 3.5232 -0.579392
N  0.759602 4.559016 1.172054
C  0.337026 0.552868 -0.243088
C  -1.793154 1.459719 -0.077864
C  -1.424071 1.168171 -1.525085
C  -3.113418 0.89047 0.409791
C  1.629387 1.231724 0.22683
C  0.553279 -0.954889 -0.34181
C  -4.334332 1.724481 0.033188
C  0.626017 -1.792684 0.770202
C  0.72725 -1.540358 -1.591993
C  -4.603509 1.851986 -1.459541
C  0.842547 -3.156732 0.645211
C  0.941722 -2.899487 -1.746785
C  0.868078 3.277193 1.421211
C  0.994168 -3.698321 -0.619027
C  1.288152 4.648244 -0.063899
H  -1.764278 2.541205 0.112457
H  -1.857726 0.221536 -1.870332
H  -1.702533 1.955885 -2.221792
H  -3.069261 0.828379 1.499707
H  -3.227579 -0.134869 0.043294
H  2.424363 1.068952 -0.498603
H  1.96032 0.8087 1.173617
H  -4.237755 2.721838 0.471895
H  -5.205281 1.270454 0.510856
H  0.69513 -0.923017 -2.478271
H  -3.836257 2.433356 -1.972208
H  -4.661104 0.874682 -1.942634
H  -5.551807 2.360624 -1.637396
H  0.891957 -3.783595 1.524523
H  1.06682 -3.320757 -2.734179
H  0.568249 2.775341 2.326966
H  1.371392 5.579449 -0.601871
elementType: Cl O N C H
totalener: -1817.03384320 hartree
nucrepener: 2164.38536252 hartree
electener: -3981.41920572 hartree
oneelecener: -6793.96472086 hartree
twoeener: 2812.54551514 hartree
cpcmener: -0.02632824 hartree
kineticenergy: 1811.92937217 hartree
xcener: -128.818023968264 hartree
chargesum: 0.0000000
charge: -0.076533 -0.084232 -0.377645 -0.388512 0.138933 -0.356665 -0.416903 0.585499 0.158645 -0.029863 -0.134945 -0.127597 -0.078996 -0.108656 -0.060076 -0.134678 -0.286996 -0.142968 -0.182709 0.052827 0.111326 0.057816 0.082745 0.101750 0.118452 0.073179 0.070869 0.130660 0.152253 0.060360 0.072889 0.152403 0.081869 0.086886 0.098521 0.122752 0.148196 0.166246 0.162896
qa: -0.0765 -0.0842 -0.3776 -0.3885 0.1389 -0.3567 -0.4169 0.5855 0.1586 -0.0299 -0.1349 -0.1276 -0.0790 -0.1087 -0.0601 -0.1347 -0.2870 -0.1430 -0.1827 0.0528 0.1113 0.0578 0.0827 0.1017 0.1185 0.0732 0.0709 0.1307 0.1523 0.0604 0.0729 0.1524 0.0819 0.0869 0.0985 0.1228 0.1482 0.1662 0.1629
va: 1.2414 1.2198 2.0094 1.9967 3.3538 2.8963 3.0204 3.8659 3.8203 3.9319 3.9426 3.7928 3.5826 3.9076 4.0453 3.9177 3.9242 4.0741 4.0452 4.0671 3.8608 4.0515 0.9958 0.9959 1.0044 1.0198 1.0098 1.0258 1.0121 1.0088 1.0074 1.0219 1.0030 1.0008 1.0041 1.0249 1.0060 1.0068 0.9948
dispcorr: -0.021861986 hartree
energy: -1817.055705185393
dipole: -26.87525 25.94057 -0.93468 25.18645 -26.27734 -1.09089 -9.89443 9.35318 -0.54125
magnitude: 1.53513 au
magnitude: 3.90198 debye
