program: Orca
programVersion: 4.2.1
elementType: Cl Cl O O N N N C C C C C C C C C C C C C C C H H H H H H H H H H H H H H H H H
charge: 0
multiplicity: 1
keywords: wb97x-d3
keywords: def2-TZVPP
keywords: def2/J RIJCOSX GRIDX6 NOFINALGRIDX
keywords: grid4 nofinalgrid
keywords: scfconv7
keywords: smallprint printgap noloewdin
keywords: NOSOSCF
formula: C15H17Cl2N3O2
InChI: InChI=1S/C15H17Cl2N3O2/c1-2-3-12-7-21-15(22-12,8-20-10-18-9-19-20)13-5-4-11(16)6-14(13)17/h4-6,9-10,12H,2-3,7-8H2,1H3
39 atoms
Cl 1.898192 -0.685692 -2.151442
Cl 0.878228 -5.448096 0.00559
O  -0.829574 0.896365 1.087105
O  -0.183229 1.076054 -1.058073
N  1.39781 2.602527 0.805731
N  1.725121 3.401461 -0.214454
N  0.800169 4.590926 1.450358
C  0.185129 0.553296 0.186879
C  -1.950606 1.424079 0.379491
C  -1.291803 1.944224 -0.887683
C  -3.019316 0.367735 0.137061
C  1.491721 1.170009 0.714834
C  0.354944 -0.958815 0.092749
C  -4.324929 0.946852 -0.404483
C  1.101991 -1.584682 -0.904045
C  -0.209249 -1.772978 1.070197
C  -5.065243 1.837455 0.584029
C  1.263555 -2.961839 -0.941707
C  -0.06133 -3.149439 1.059274
C  0.839042 3.323469 1.779678
C  0.675459 -3.733037 0.044664
C  1.351016 4.575599 0.221327
H  -2.34664 2.240796 0.985484
H  -1.928303 1.869945 -1.770034
H  -0.971863 2.98634 -0.788106
H  -3.220873 -0.15187 1.078269
H  -2.638438 -0.384485 -0.560637
H  2.333984 0.923682 0.072983
H  1.703602 0.769283 1.705787
H  -4.973289 0.11525 -0.687907
H  -4.136417 1.501271 -1.328703
H  -0.783654 -1.32816 1.869421
H  -5.272926 1.305751 1.514472
H  -4.503989 2.737463 0.838572
H  -6.020981 2.164406 0.173137
H  1.843914 -3.42093 -1.729645
H  -0.515413 -3.749452 1.834972
H  0.50259 2.894407 2.709521
H  1.489952 5.465908 -0.371631
elementType: Cl O N C H
totalener: -1817.03365034 hartree
nucrepener: 2167.35022521 hartree
electener: -3984.38387555 hartree
oneelecener: -6800.07576465 hartree
twoeener: 2815.69188909 hartree
cpcmener: -0.02785234 hartree
kineticenergy: 1811.92600488 hartree
xcener: -128.819625433691 hartree
chargesum: 0.0000000
charge: -0.074125 -0.084171 -0.423920 -0.370321 0.112763 -0.351713 -0.409721 0.594825 0.174738 -0.015822 -0.179973 -0.117566 -0.067743 -0.106767 -0.052574 -0.140565 -0.274064 -0.142400 -0.181702 0.055549 0.109613 0.055120 0.110472 0.103283 0.091595 0.076231 0.087236 0.133899 0.142347 0.075558 0.059556 0.151506 0.082195 0.078522 0.093379 0.122799 0.148024 0.173855 0.160083
qa: -0.0741 -0.0842 -0.4239 -0.3703 0.1128 -0.3517 -0.4097 0.5948 0.1747 -0.0158 -0.1800 -0.1176 -0.0677 -0.1068 -0.0526 -0.1406 -0.2741 -0.1424 -0.1817 0.0555 0.1096 0.0551 0.1105 0.1033 0.0916 0.0762 0.0872 0.1339 0.1423 0.0756 0.0596 0.1515 0.0822 0.0785 0.0934 0.1228 0.1480 0.1739 0.1601
va: 1.2455 1.2199 1.9772 2.0025 3.3817 2.8703 3.0237 3.8191 3.8592 3.9846 3.9532 3.8154 3.5135 3.9031 4.0482 3.9220 3.9273 4.0757 4.0572 4.0678 3.8656 4.0491 1.0003 1.0046 0.9941 1.0140 1.0053 1.0300 1.0052 1.0059 1.0134 1.0230 1.0011 1.0021 1.0040 1.0246 1.0064 1.0011 0.9976
dispcorr: -0.022211960 hartree
energy: -1817.055862298639
dipole: -31.47456 30.12532 -1.34924 23.18229 -24.10791 -0.92562 8.24286 -7.30825 0.93461
magnitude: 1.88433 au
magnitude: 4.78959 debye
