program: Orca
programVersion: 4.2.1
elementType: Cl Cl O O N N N C C C C C C C C C C C C C C C H H H H H H H H H H H H H H H H H
charge: 0
multiplicity: 1
keywords: wb97x-d3
keywords: def2-TZVPP
keywords: def2/J RIJCOSX GRIDX6 NOFINALGRIDX
keywords: grid4 nofinalgrid
keywords: scfconv7
keywords: smallprint printgap noloewdin
keywords: NOSOSCF
formula: C15H17Cl2N3O2
InChI: InChI=1S/C15H17Cl2N3O2/c1-2-3-12-7-21-15(22-12,8-20-10-18-9-19-20)13-5-4-11(16)6-14(13)17/h4-6,9-10,12H,2-3,7-8H2,1H3
39 atoms
Cl 2.155547 -0.718104 -1.869116
Cl 0.474989 -5.376897 0.090297
O  -0.834926 1.077901 0.992625
O  0.090043 1.223467 -1.031556
N  1.547498 2.664478 0.875843
N  2.184568 3.351613 -0.076236
N  1.075563 4.744484 1.290717
C  0.268351 0.667322 0.232576
C  -1.897239 1.470107 0.118298
C  -1.305218 1.211752 -1.266217
C  -3.169331 0.697516 0.402713
C  1.532162 1.226107 0.888053
C  0.3420 -0.859153 0.176882
C  -4.328357 1.159458 -0.473681
C  1.14461 -1.546326 -0.73316
C  -0.395134 -1.62301 1.076418
C  -5.603854 0.380147 -0.193157
C  1.188965 -2.932174 -0.769227
C  -0.365575 -3.007344 1.067644
C  0.884999 3.505233 1.671774
C  0.425845 -3.650842 0.133656
C  1.875275 4.586082 0.219227
H  -2.072161 2.541041 0.269418
H  -1.630608 0.244355 -1.669704
H  -1.543058 1.986802 -1.992184
H  -3.440909 0.821318 1.454768
H  -2.991493 -0.371112 0.244071
H  2.429313 0.877418 0.383419
H  1.580356 0.874286 1.91789
H  -4.066045 1.051167 -1.530523
H  -4.505485 2.226501 -0.311157
H  -1.016624 -1.129248 1.809118
H  -5.467852 -0.684804 -0.390624
H  -5.911411 0.484621 0.848998
H  -6.42835 0.727482 -0.816477
H  1.811383 -3.437976 -1.494077
H  -0.95573 -3.567168 1.779304
H  0.303316 3.181368 2.51996
H  2.248324 5.413552 -0.364143
elementType: Cl O N C H
totalener: -1817.03568915 hartree
nucrepener: 2154.11607664 hartree
electener: -3971.15176579 hartree
oneelecener: -6773.44473227 hartree
twoeener: 2802.29296648 hartree
cpcmener: -0.02857416 hartree
kineticenergy: 1811.93341398 hartree
xcener: -128.818725136214 hartree
chargesum: 0.0000000
charge: -0.073896 -0.083577 -0.406163 -0.360475 0.123448 -0.353042 -0.423593 0.573826 0.168071 -0.007841 -0.171741 -0.095482 -0.108968 -0.084958 -0.021760 -0.176008 -0.285358 -0.149328 -0.180425 0.064831 0.115528 0.058233 0.090602 0.091075 0.123503 0.077820 0.066724 0.131317 0.143406 0.066809 0.067811 0.162802 0.080488 0.081228 0.092640 0.121797 0.147317 0.170763 0.162575
qa: -0.0739 -0.0836 -0.4062 -0.3605 0.1234 -0.3530 -0.4236 0.5738 0.1681 -0.0078 -0.1717 -0.0955 -0.1090 -0.0850 -0.0218 -0.1760 -0.2854 -0.1493 -0.1804 0.0648 0.1155 0.0582 0.0906 0.0911 0.1235 0.0778 0.0667 0.1313 0.1434 0.0668 0.0678 0.1628 0.0805 0.0812 0.0926 0.1218 0.1473 0.1708 0.1626
va: 1.2470 1.2204 1.9815 2.0026 3.3753 2.8862 3.0213 3.8931 3.8779 3.9165 3.9799 3.7769 3.5262 3.8744 4.0094 3.9557 3.9464 4.0815 4.0568 4.0630 3.8579 4.0554 1.0048 0.9991 0.9909 1.0139 1.0047 1.0337 1.0064 1.0081 1.0084 1.0156 1.0009 1.0005 1.0029 1.0259 1.0067 1.0036 0.9948
dispcorr: -0.021432815 hartree
energy: -1817.057121961272
dipole: -33.36449 31.60473 -1.75976 18.88805 -20.20718 -1.31914 4.93418 -4.26888 0.66531
magnitude: 2.29772 au
magnitude: 5.84034 debye
