program: Orca
programVersion: 4.2.1
elementType: Cl Cl O O N N N C C C C C C C C C C C C C C C H H H H H H H H H H H H H H H H H
charge: 0
multiplicity: 1
keywords: wb97x-d3
keywords: def2-TZVPP
keywords: def2/J RIJCOSX GRIDX6 NOFINALGRIDX
keywords: grid4 nofinalgrid
keywords: scfconv7
keywords: smallprint printgap noloewdin
keywords: NOSOSCF
formula: C15H17Cl2N3O2
InChI: InChI=1S/C15H17Cl2N3O2/c1-2-3-12-7-21-15(22-12,8-20-10-18-9-19-20)13-5-4-11(16)6-14(13)17/h4-6,9-10,12H,2-3,7-8H2,1H3
39 atoms
Cl -0.00547 -1.079234 2.397734
Cl 0.753647 -5.293295 -0.767695
O  -0.654158 1.140067 0.601134
O  0.230281 1.296188 -1.427649
N  1.734612 2.688651 0.494829
N  2.264115 3.441884 -0.473412
N  1.287218 4.732489 1.08165
C  0.424761 0.717803 -0.172803
C  -1.784639 1.3173 -0.250577
C  -1.168663 1.305916 -1.659416
C  -2.827682 0.233246 -0.034932
C  1.726531 1.25204 0.423792
C  0.500328 -0.806957 -0.278844
C  -4.094343 0.449244 -0.860797
C  0.31256 -1.667416 0.801245
C  0.804418 -1.386399 -1.507521
C  -4.915383 1.658298 -0.433342
C  0.386037 -3.045462 0.659575
C  0.88827 -2.757522 -1.677671
C  1.149183 3.469506 1.402872
C  0.668205 -3.577691 -0.585689
C  1.975192 4.651292 -0.073109
H  -2.20367 2.298413 -0.014171
H  -1.476819 0.42127 -2.228687
H  -1.415488 2.191447 -2.243594
H  -3.090683 0.195125 1.025691
H  -2.392534 -0.738365 -0.286825
H  2.57218 0.934064 -0.182587
H  1.873201 0.847408 1.424251
H  -4.71147 -0.447604 -0.775372
H  -3.842277 0.532218 -1.922776
H  0.978786 -0.753405 -2.366113
H  -4.389048 2.600048 -0.594876
H  -5.847755 1.713149 -0.996153
H  -5.174143 1.603173 0.625814
H  0.226234 -3.689933 1.512634
H  1.120255 -3.171619 -2.648632
H  0.658713 3.085237 2.282405
H  2.279582 5.517881 -0.638648
elementType: Cl O N C H
totalener: -1817.03337482 hartree
nucrepener: 2173.21450117 hartree
electener: -3990.24787598 hartree
oneelecener: -6811.55632095 hartree
twoeener: 2821.30844496 hartree
cpcmener: -0.02771089 hartree
kineticenergy: 1811.93394552 hartree
xcener: -128.820514189702 hartree
chargesum: -0.0000000
charge: -0.074629 -0.083481 -0.386163 -0.383535 0.128462 -0.358611 -0.423666 0.603114 0.210325 -0.049525 -0.175152 -0.106616 -0.171335 -0.112679 -0.021872 -0.138565 -0.273343 -0.135248 -0.188684 0.071399 0.115273 0.059176 0.105290 0.095480 0.118738 0.070088 0.079747 0.131652 0.149255 0.076134 0.062180 0.152710 0.079072 0.094186 0.082868 0.121561 0.148797 0.165087 0.162511
qa: -0.0746 -0.0835 -0.3862 -0.3835 0.1285 -0.3586 -0.4237 0.6031 0.2103 -0.0495 -0.1752 -0.1066 -0.1713 -0.1127 -0.0219 -0.1386 -0.2733 -0.1352 -0.1887 0.0714 0.1153 0.0592 0.1053 0.0955 0.1187 0.0701 0.0797 0.1317 0.1493 0.0761 0.0622 0.1527 0.0791 0.0942 0.0829 0.1216 0.1488 0.1651 0.1625
va: 1.2416 1.2207 1.9946 1.9898 3.3594 2.8901 3.0263 3.8475 3.7980 3.9350 3.9821 3.7763 3.5600 3.9096 3.9890 3.9447 3.9275 4.0746 4.0494 4.0675 3.8570 4.0560 0.9990 0.9977 0.9967 1.0198 1.0051 1.0225 1.0110 1.0053 1.0107 1.0212 1.0006 1.0039 1.0006 1.0264 1.0055 1.0061 0.9948
dispcorr: -0.022179087 hartree
energy: -1817.055553905080
dipole: -24.17287 23.07629 -1.09658 20.96629 -22.38459 -1.41830 -9.76081 9.15156 -0.60925
magnitude: 1.89347 au
magnitude: 4.81282 debye
