program: Gaussian 09
title: 000030601
version: EM64L-G09RevD.01
frameworkgroup: C1[X(C14H17BrN2O)]
method: RPBEPBE
basis: SDD
operation: Freq
keyword: #p
keyword: freq=noraman
keyword: PBEPBE/SDD
title: #p freq=noraman PBEPBE/SDD
converged: YES YES NO NO
title: Mulliken charges:
elementType: Br O N N C C C C C C C C C C C C C C H H H H H H H H H H H H H H H H H
charge: 0.004712 -0.227321 -0.107459 -0.456022 -0.499027 -0.415918 -0.406906 0.187854 0.495104 -0.059448 -0.063822 -0.440378 -0.332941 -0.151689 -0.166312 -0.236698 -0.583130 -0.583818 0.192356 0.272131 0.189452 0.240741 0.186343 0.239666 0.304996 0.253763 0.249241 0.227028 0.313408 0.249980 0.250028 0.219099 0.216858 0.220426 0.217703
chargesum: 0.00000
title: Mulliken charges with hydrogens summed into heavy atoms:
elementType: Br O N N C C C C C C C C C C C C C C
charge: 0.004712 -0.227321 -0.107459 -0.151026 -0.034540 0.014275 0.019103 0.187854 0.495104 0.194315 0.185419 -0.213350 -0.019533 0.098291 0.083716 -0.236698 -0.147173 -0.145689
polarizability: 2.94760658e+02 -1.50437785e+00 1.62922935e+02 -3.80936157e+00 -2.06278155e+01 1.31882461e+02
1716.lowfreq: -4.4900 -1.7546 -0.0005 -0.0005 -0.0001 3.9193 14.2366 23.9663 29.4186
frequency: 13.3260 23.9537 29.3454 56.1807 65.4939 76.2411 78.5583 90.1841 97.5891 140.1004 159.5496 173.7728 211.1717 232.2434 246.6079 320.0419 325.0299 343.7085 360.0798 373.0192 382.3152 410.1366 455.6720 465.6502 507.2405 577.1505 594.3671 621.4886 641.4160 646.4701 653.3762 707.6724 734.3459 806.7271 816.4710 849.5340 852.8586 900.3047 915.1876 940.3272 942.3417 946.8799 950.7539 958.7210 977.0503 986.9799 989.1000 989.5140 1018.7001 1020.2093 1061.4315 1115.4956 1118.0454 1124.5070 1147.1800 1154.3471 1176.3472 1186.9795 1234.7397 1256.6864 1262.8798 1266.0817 1276.1094 1278.3577 1293.9169 1346.6398 1353.3109 1358.9316 1367.9977 1396.7992 1425.2698 1427.3831 1449.7448 1455.7899 1468.3974 1473.7182 1497.8703 1589.8169 1602.7030 1637.2984 1655.1516 1657.5493 2777.9806 2852.1276 2864.6271 2996.2197 3006.5990 3022.2495 3084.5044 3085.4867 3107.4564 3112.4400 3119.3874 3165.2715 3171.4235 3195.4931 3196.0969 3196.1985 3506.7523
redmass: 5.1504 5.0567 4.3784 5.3756 3.7148 3.1521 4.4635 2.2805 3.2660 5.4209 4.5293 4.9205 2.2676 4.5675 3.3255 5.4345 4.1207 4.6139 4.8560 2.6615 2.3694 2.9817 2.1459 2.6047 2.7203 3.1858 2.0596 6.3290 3.2188 1.1866 1.6781 3.3975 4.9089 4.7973 1.4060 1.4304 3.0860 1.5029 2.5798 2.0682 1.3680 1.4769 1.3371 1.8129 2.1668 1.3606 3.1721 2.4086 1.1800 1.2058 2.5441 1.4692 1.9149 2.0543 2.3204 2.4673 2.2046 1.1193 1.1527 1.6802 1.5253 1.4948 1.2568 1.2582 1.3531 1.6642 1.7092 1.4891 2.2038 4.3381 1.1983 1.2065 1.0992 1.0960 1.0883 2.3185 2.2592 5.7051 6.1172 5.4017 4.6714 4.7300 1.0708 1.0709 1.0701 1.0828 1.0866 1.0869 1.0600 1.0601 1.0943 1.0943 1.0902 1.0911 1.0950 1.1140 1.1139 1.0955 1.0758
irintensity: 0.9188 0.5703 0.0507 0.3150 0.0858 0.3140 6.7572 1.1790 0.7916 0.4301 1.6422 1.8592 3.9824 2.0847 1.7582 1.3165 5.0417 14.8871 7.3664 7.8737 2.1176 0.0391 3.9129 2.3662 43.0101 5.0523 6.2745 0.3482 8.0931 52.7961 10.8601 0.5212 16.2565 13.0342 39.6757 46.0216 26.8410 8.9671 2.7132 18.1665 1.4545 38.2731 126.9684 7.9421 29.3758 5.0207 6.7797 61.1596 18.4979 21.5709 43.6979 38.8960 22.0851 33.1238 69.6095 63.7015 5.3489 7.3259 3.4595 37.0931 58.2502 14.5002 15.5419 8.9066 20.4111 47.9456 38.4061 3.0543 62.5236 20.6848 15.8275 18.6571 4.4938 4.5370 4.7888 99.4336 585.4932 49.4551 19.9091 103.7955 7.8532 9.0955 129.0563 51.2718 150.3566 19.6624 12.5691 10.9871 10.7267 12.3088 6.7699 6.1701 15.6771 3.7459 3.6502 20.5583 30.2599 9.9200 10.3640
temp: 298.150 k
press: 1.00000 atm
elementType: 35 8 7 7 6 6 6 6 6 6 6 6 6 6 6 6 6 6 1 1 1 1 1 1 1 1 1 1 1 1 1 1 1 1 1
symmnumber: 1
zpe: 731235.0 jmol-1
zpe.correction: 0.278513 hartree
zpe.thermalcorrener: 0.297637 hartree
zpe.thermalcorrenthalpy: 0.298581 hartree
zpe.thermalcorrgfe: 0.226594 hartree
zpe.sumelectzpe: -740.484865 hartree
zpe.sumelectthermal: -740.465741 hartree
zpe.sumelectthermalent: -740.464796 hartree
zpe.sumelectthermalfe: -740.536784 hartree
dipole: -2.5298 -2.5628 3.3538
dipole: 4.9209
quadrupole: -123.7402 -113.6822 -112.4504
quadrupole: 1.1106 -4.5106 -5.2488
quadrupole: -7.1159 2.9421 4.1739 1.1106 -4.5106 -5.2488
hfenergy: -740.7633773 hartree
pointgroup: C01 [X(C14H17Br1N2O1)]
dipole: 0.9337401 0.9351244 1.414886 debye
polarizability: 293.8068382|-4.6105607|161.0919883|12.5688441|21.6617034|134.6672273 unknown
InChI: InChI=1S/C14H17BrN2O/c1-3-9-17(10-4-2)11-14(18)16-13-7-5-12(15)6-8-13/h3-8,16H,1-2,9-11H2
charge 0 multiplicity 1
35 atoms
Br -6.904229 -0.161727 -0.593918
O  0.227334 -0.716993 -1.049011
N  2.773652 -0.124613 0.157644
N  -0.854103 0.599557 0.567297
C  1.589255 0.645205 0.523608
C  2.807606 -1.502581 0.707395
C  4.042607 0.627075 0.316616
C  0.27766 0.085793 -0.077057
C  -2.226484 0.39171 0.257053
C  3.777208 -2.386929 -0.048474
C  4.129204 1.799937 -0.638217
C  -3.190722 1.050018 1.067585
C  -2.662562 -0.435379 -0.813262
C  -4.569235 0.89144 0.822475
C  -4.043538 -0.593056 -1.059248
C  -4.984013 0.067383 -0.244031
C  4.732554 -3.15979 0.525881
C  4.456528 3.067924 -0.282839
H  1.453646 0.747673 1.63721
H  1.719079 1.67473 0.133457
H  3.050041 -1.51827 1.800098
H  1.79297 -1.926336 0.583671
H  4.204913 0.980295 1.366944
H  4.860741 -0.084234 0.089546
H  -0.671532 1.211725 1.367673
H  3.638796 -2.386304 -1.138973
H  3.915119 1.55458 -1.68864
H  -2.868246 1.692425 1.896849
H  -1.924268 -0.943536 -1.435549
H  -5.302905 1.402036 1.452321
H  -4.375739 -1.23008 -1.883967
H  5.379009 -3.811939 -0.071793
H  4.888976 -3.168765 1.61242
H  4.538403 3.869289 -1.025487
H  4.665577 3.336639 0.760923
