program: Orca
programVersion: 4.2.1
elementType: Cl Cl O O N N N C C C C C C C C C C C C C C C H H H H H H H H H H H H H H H H H
charge: 0
multiplicity: 1
keywords: wb97x-d3
keywords: def2-TZVPP
keywords: def2/J RIJCOSX GRIDX6 NOFINALGRIDX
keywords: grid4 nofinalgrid
keywords: scfconv7
keywords: smallprint printgap noloewdin
keywords: NOSOSCF
formula: C15H17Cl2N3O2
InChI: InChI=1S/C15H17Cl2N3O2/c1-2-3-12-7-21-15(22-12,8-20-10-18-9-19-20)13-5-4-11(16)6-14(13)17/h4-6,9-10,12H,2-3,7-8H2,1H3
39 atoms
Cl -0.520034 -0.60263 2.551511
Cl 2.0807 -4.078617 -0.535768
O  -1.741851 1.349746 0.716608
O  -0.73077 1.913942 -1.181181
N  1.784851 2.216454 0.380011
N  2.679095 1.409357 0.954417
N  3.565107 2.406089 -0.843302
C  -0.50331 1.35606 0.077728
C  -2.774234 1.299868 -0.267417
C  -2.009291 1.45533 -1.587761
C  -3.582872 0.020822 -0.169472
C  0.42951 2.286534 0.860351
C  0.093573 -0.045737 -0.055139
C  -4.757203 0.012978 -1.141861
C  0.14124 -0.961879 0.992699
C  0.697133 -0.419512 -1.252088
C  -5.582117 -1.260745 -1.046352
C  0.743414 -2.203337 0.853085
C  1.307829 -1.650039 -1.42047
C  2.323104 2.798814 -0.6950
C  1.322949 -2.535536 -0.358346
C  3.73028 1.557977 0.191626
H  -3.42908 2.160541 -0.095603
H  -1.933706 0.503347 -2.127469
H  -2.444986 2.195582 -2.257293
H  -3.958002 -0.086676 0.852214
H  -2.933221 -0.840398 -0.359628
H  0.43722 2.018807 1.91448
H  0.066076 3.311065 0.775346
H  -4.397893 0.130052 -2.169293
H  -5.39672 0.878596 -0.944241
H  0.700047 0.267797 -2.086581
H  -5.980498 -1.402061 -0.039754
H  -6.428594 -1.23814 -1.733923
H  -4.984614 -2.141215 -1.289934
H  0.763751 -2.896077 1.682992
H  1.766283 -1.903913 -2.365979
H  1.786243 3.494681 -1.320422
H  4.654483 1.037354 0.389158
elementType: Cl O N C H
totalener: -1817.04403849 hartree
nucrepener: 2202.40183609 hartree
electener: -4019.44587458 hartree
oneelecener: -6870.52938894 hartree
twoeener: 2851.08351437 hartree
cpcmener: -0.02373624 hartree
kineticenergy: 1811.91443901 hartree
xcener: -128.815461545415 hartree
chargesum: -0.0000000
charge: -0.073951 -0.083689 -0.373566 -0.380574 0.110714 -0.333357 -0.404312 0.602515 0.209805 -0.070802 -0.177320 -0.093820 -0.163564 -0.088119 -0.012399 -0.140040 -0.280599 -0.136891 -0.194770 0.059195 0.119316 0.059660 0.096035 0.097377 0.124520 0.070689 0.062937 0.131692 0.129789 0.063076 0.066331 0.154283 0.080679 0.092065 0.080946 0.118996 0.145924 0.171179 0.160049
qa: -0.0740 -0.0837 -0.3736 -0.3806 0.1107 -0.3334 -0.4043 0.6025 0.2098 -0.0708 -0.1773 -0.0938 -0.1636 -0.0881 -0.0124 -0.1400 -0.2806 -0.1369 -0.1948 0.0592 0.1193 0.0597 0.0960 0.0974 0.1245 0.0707 0.0629 0.1317 0.1298 0.0631 0.0663 0.1543 0.0807 0.0921 0.0809 0.1190 0.1459 0.1712 0.1600
va: 1.2441 1.2203 2.0224 1.9868 3.3620 2.8786 3.0342 3.8238 3.8522 3.9559 3.9772 3.8297 3.5358 3.8793 3.9718 3.8647 3.9456 4.0946 4.0856 4.0659 3.8566 4.0444 1.0030 0.9924 0.9937 1.0191 1.0054 1.0260 1.0215 1.0092 1.0085 1.0169 1.0010 1.0029 1.0011 1.0263 1.0060 1.0029 0.9963
dispcorr: -0.022882718 hartree
energy: -1817.066921206885
dipole: -31.65043 29.37251 -2.27792 11.63789 -11.03535 0.60254 -13.17017 12.19462 -0.97555
magnitude: 2.55023 au
magnitude: 6.48218 debye
