program: Orca
programVersion: 4.2.1
elementType: Cl Cl O O N N N C C C C C C C C C C C C C C C H H H H H H H H H H H H H H H H H
charge: 0
multiplicity: 1
keywords: wb97x-d3
keywords: def2-TZVPP
keywords: def2/J RIJCOSX GRIDX6 NOFINALGRIDX
keywords: grid4 nofinalgrid
keywords: scfconv7
keywords: smallprint printgap noloewdin
keywords: NOSOSCF
formula: C15H17Cl2N3O2
InChI: InChI=1S/C15H17Cl2N3O2/c1-2-3-12-7-21-15(22-12,8-20-10-18-9-19-20)13-5-4-11(16)6-14(13)17/h4-6,9-10,12H,2-3,7-8H2,1H3
39 atoms
Cl 0.023214 -0.965568 2.402357
Cl 0.634378 -5.296186 -0.637982
O  -0.558197 1.211875 0.544886
O  0.325935 1.285753 -1.489575
N  1.844612 2.680182 0.457363
N  2.275635 3.450664 -0.543211
N  1.493016 4.709214 1.136028
C  0.50305 0.738069 -0.222338
C  -1.66845 1.475468 -0.309422
C  -1.071275 1.326376 -1.716053
C  -2.82766 0.536085 -0.033383
C  1.824475 1.246974 0.356475
C  0.526516 -0.790722 -0.283923
C  -4.050916 0.87083 -0.879424
C  0.313591 -1.611609 0.822221
C  0.807628 -1.416225 -1.495402
C  -5.211129 -0.077872 -0.620768
C  0.343426 -2.995011 0.721361
C  0.845794 -2.793721 -1.624736
C  1.373297 3.442093 1.447558
C  0.603809 -3.573646 -0.507927
C  2.049704 4.65636 -0.091028
H  -1.981434 2.50837 -0.125723
H  -1.417364 0.407747 -2.205846
H  -1.292363 2.167533 -2.371921
H  -3.091724 0.595095 1.02626
H  -2.515848 -0.496503 -0.223915
H  2.654366 0.929533 -0.273134
H  1.986043 0.823703 1.347164
H  -3.793771 0.838753 -1.943083
H  -4.36473 1.898886 -0.674463
H  1.00005 -0.813323 -2.372262
H  -6.077423 0.176709 -1.232754
H  -4.938527 -1.109767 -0.85103
H  -5.526121 -0.046555 0.424144
H  0.16737 -3.608294 1.594186
H  1.060605 -3.244149 -2.583746
H  0.973402 3.035146 2.362966
H  2.299186 5.535557 -0.664966
elementType: Cl O N C H
totalener: -1817.04470086 hartree
nucrepener: 2167.40508674 hartree
electener: -3984.44978760 hartree
oneelecener: -6799.96445761 hartree
twoeener: 2815.51467001 hartree
cpcmener: -0.02427543 hartree
kineticenergy: 1811.91864284 hartree
xcener: -128.816287887005 hartree
chargesum: 0.0000000
charge: -0.072962 -0.081783 -0.376272 -0.368077 0.131143 -0.351895 -0.415548 0.596429 0.228884 -0.064266 -0.178575 -0.115332 -0.154998 -0.092476 -0.030389 -0.143683 -0.279941 -0.138930 -0.185131 0.065340 0.114253 0.059680 0.096180 0.096383 0.121195 0.069581 0.063461 0.131422 0.145955 0.064470 0.068518 0.152496 0.092164 0.079781 0.081092 0.120987 0.146725 0.163827 0.160294
qa: -0.0730 -0.0818 -0.3763 -0.3681 0.1311 -0.3519 -0.4155 0.5964 0.2289 -0.0643 -0.1786 -0.1153 -0.1550 -0.0925 -0.0304 -0.1437 -0.2799 -0.1389 -0.1851 0.0653 0.1143 0.0597 0.0962 0.0964 0.1212 0.0696 0.0635 0.1314 0.1460 0.0645 0.0685 0.1525 0.0922 0.0798 0.0811 0.1210 0.1467 0.1638 0.1603
va: 1.2428 1.2223 2.0023 2.0084 3.3594 2.8945 3.0305 3.8638 3.8131 3.9406 3.9898 3.7862 3.5468 3.8779 3.9997 3.9411 3.9448 4.0756 4.0472 4.0697 3.8652 4.0525 1.0015 0.9934 0.9946 1.0197 1.0029 1.0234 1.0118 1.0093 1.0081 1.0213 1.0031 1.0013 1.0009 1.0266 1.0063 1.0039 0.9952
dispcorr: -0.021762233 hartree
energy: -1817.066463089840
dipole: -24.38841 23.37270 -1.01571 17.82181 -19.10499 -1.28318 -10.60315 9.96907 -0.63408
magnitude: 1.75507 au
magnitude: 4.46104 debye
