program: Orca
programVersion: 4.2.1
elementType: Cl Cl O O N N N C C C C C C C C C C C C C C C H H H H H H H H H H H H H H H H H
charge: 0
multiplicity: 1
keywords: wb97x-d3
keywords: def2-TZVPP
keywords: def2/J RIJCOSX GRIDX6 NOFINALGRIDX
keywords: grid4 nofinalgrid
keywords: scfconv7
keywords: smallprint printgap noloewdin
keywords: NOSOSCF
formula: C15H17Cl2N3O2
InChI: InChI=1S/C15H17Cl2N3O2/c1-2-3-12-7-21-15(22-12,8-20-10-18-9-19-20)13-5-4-11(16)6-14(13)17/h4-6,9-10,12H,2-3,7-8H2,1H3
39 atoms
Cl -0.693862 -0.470703 2.464084
Cl 1.709544 -4.175528 -0.513484
O  -1.810398 1.477506 0.492314
O  -0.601607 1.972599 -1.334675
N  1.766837 2.171185 0.485891
N  2.272681 2.731241 -0.614292
N  3.819578 1.474006 0.406812
C  -0.524949 1.428479 -0.04666
C  -2.744524 1.573924 -0.581094
C  -1.939568 2.368012 -1.597173
C  -3.208605 0.217124 -1.08808
C  0.378511 2.30631 0.838585
C  0.017816 0.002333 -0.139577
C  -3.851788 -0.654904 -0.017849
C  -0.022616 -0.898177 0.922943
C  0.625395 -0.43207 -1.314327
C  -4.212673 -2.03659 -0.541138
C  0.487981 -2.183488 0.817069
C  1.150156 -1.705874 -1.446317
C  2.697075 1.418158 1.079638
C  1.069991 -2.576365 -0.374409
C  3.503999 2.289279 -0.618781
H  -3.598365 2.143655 -0.207352
H  -2.186102 2.126202 -2.631968
H  -2.057077 3.44675 -1.455121
H  -2.375341 -0.31984 -1.553598
H  -3.931476 0.402137 -1.889154
H  0.271566 2.030596 1.885756
H  0.082586 3.350488 0.738483
H  -4.749578 -0.159112 0.364401
H  -3.175224 -0.759769 0.832956
H  0.691558 0.238074 -2.158926
H  -4.690537 -2.642009 0.230436
H  -4.900458 -1.981682 -1.387516
H  -3.323845 -2.57604 -0.875386
H  0.433818 -2.862613 1.656683
H  1.612936 -2.007815 -2.375482
H  2.516164 0.866309 1.98912
H  4.205845 2.570143 -1.388789
elementType: Cl O N C H
totalener: -1817.04226417 hartree
nucrepener: 2237.23082344 hartree
electener: -4054.27308761 hartree
oneelecener: -6940.16271345 hartree
twoeener: 2885.88962583 hartree
cpcmener: -0.02485599 hartree
kineticenergy: 1811.91246813 hartree
xcener: -128.816981951994 hartree
chargesum: 0.0000000
charge: -0.077539 -0.082114 -0.372251 -0.383970 0.130534 -0.347198 -0.399074 0.560235 0.199840 0.007451 -0.215303 -0.145459 -0.055891 -0.098340 -0.079314 -0.166699 -0.278173 -0.103667 -0.152148 0.065978 0.097838 0.058135 0.108948 0.092683 0.090194 0.077041 0.091657 0.139421 0.121714 0.070061 0.060184 0.142992 0.092028 0.081377 0.077658 0.120153 0.146919 0.164213 0.159884
qa: -0.0775 -0.0821 -0.3723 -0.3840 0.1305 -0.3472 -0.3991 0.5602 0.1998 0.0075 -0.2153 -0.1455 -0.0559 -0.0983 -0.0793 -0.1667 -0.2782 -0.1037 -0.1521 0.0660 0.0978 0.0581 0.1089 0.0927 0.0902 0.0770 0.0917 0.1394 0.1217 0.0701 0.0602 0.1430 0.0920 0.0814 0.0777 0.1202 0.1469 0.1642 0.1599
va: 1.2366 1.2217 2.0175 1.9827 3.3371 2.8877 3.0348 3.8581 3.8868 3.9999 3.9309 3.9126 3.4668 3.8666 3.9586 3.8943 3.9468 4.0540 4.0382 4.0634 3.8792 4.0544 0.9931 0.9914 0.9962 0.9983 1.0128 1.0105 1.0195 1.0084 1.0248 1.0346 1.0036 1.0013 1.0009 1.0238 1.0037 0.9989 0.9963
dispcorr: -0.024282316 hartree
energy: -1817.066546490584
dipole: -25.09612 22.97052 -2.12560 10.06192 -9.67051 0.39142 -10.42200 10.16721 -0.25479
magnitude: 2.17630 au
magnitude: 5.53173 debye
