program: Orca
programVersion: 4.2.1
elementType: Cl Cl O O N N N C C C C C C C C C C C C C C C H H H H H H H H H H H H H H H H H
charge: 0
multiplicity: 1
keywords: wb97x-d3
keywords: def2-TZVPP
keywords: def2/J RIJCOSX GRIDX6 NOFINALGRIDX
keywords: grid4 nofinalgrid
keywords: scfconv7
keywords: smallprint printgap noloewdin
keywords: NOSOSCF
formula: C15H17Cl2N3O2
InChI: InChI=1S/C15H17Cl2N3O2/c1-2-3-12-7-21-15(22-12,8-20-10-18-9-19-20)13-5-4-11(16)6-14(13)17/h4-6,9-10,12H,2-3,7-8H2,1H3
39 atoms
Cl -0.603149 -0.3301 2.465139
Cl 1.70289 -4.139749 -0.458306
O  -1.837829 1.515112 0.425554
O  -0.656022 1.968333 -1.426997
N  1.735803 2.158847 0.475344
N  2.301204 2.470097 -0.691529
N  3.76118 1.396736 0.624227
C  -0.557006 1.46491 -0.1241
C  -2.784997 1.534169 -0.638631
C  -2.009891 2.284828 -1.711885
C  -3.232281 0.142696 -1.061582
C  0.3386 2.386006 0.726468
C  0.001797 0.041715 -0.179801
C  -3.808678 -0.690028 0.075725
C  0.009854 -0.816589 0.917468
C  0.565894 -0.435306 -1.359606
C  -4.148174 -2.106918 -0.360132
C  0.524379 -2.102226 0.84218
C  1.091568 -1.711304 -1.463213
C  2.613852 1.510374 1.245995
C  1.059952 -2.539323 -0.355844
C  3.514456 1.998833 -0.555801
H  -3.644513 2.10885 -0.286099
H  -2.249754 1.957139 -2.724752
H  -2.169931 3.365477 -1.649742
H  -2.403662 -0.395405 -1.534018
H  -3.990028 0.271142 -1.841365
H  0.162211 2.214677 1.786018
H  0.090742 3.426302 0.513995
H  -4.704931 -0.199766 0.468703
H  -3.096433 -0.732104 0.902191
H  0.5939 0.203692 -2.229735
H  -4.582842 -2.680991 0.459483
H  -4.864875 -2.116759 -1.183866
H  -3.25578 -2.640382 -0.694672
H  0.509653 -2.747685 1.709445
H  1.518465 -2.048173 -2.397665
H  2.378252 1.157196 2.238257
H  4.252125 2.092881 -1.337605
elementType: Cl O N C H
totalener: -1817.04163281 hartree
nucrepener: 2245.38026317 hartree
electener: -4062.42189599 hartree
oneelecener: -6956.56318504 hartree
twoeener: 2894.14128906 hartree
cpcmener: -0.02477864 hartree
kineticenergy: 1811.91636636 hartree
xcener: -128.818158982982 hartree
chargesum: -0.0000000
charge: -0.076607 -0.082647 -0.368780 -0.385156 0.132082 -0.346922 -0.399267 0.569664 0.200653 0.006643 -0.216074 -0.158293 -0.009041 -0.099035 -0.114038 -0.197778 -0.278368 -0.094907 -0.136442 0.072402 0.087389 0.059127 0.109111 0.092498 0.089847 0.077043 0.092528 0.136369 0.123806 0.070940 0.059910 0.142210 0.091954 0.081350 0.077431 0.119931 0.146778 0.164363 0.159328
qa: -0.0766 -0.0826 -0.3688 -0.3852 0.1321 -0.3469 -0.3993 0.5697 0.2007 0.0066 -0.2161 -0.1583 -0.0090 -0.0990 -0.1140 -0.1978 -0.2784 -0.0949 -0.1364 0.0724 0.0874 0.0591 0.1091 0.0925 0.0898 0.0770 0.0925 0.1364 0.1238 0.0709 0.0599 0.1422 0.0920 0.0813 0.0774 0.1199 0.1468 0.1644 0.1593
va: 1.2389 1.2214 2.0183 1.9812 3.3416 2.8808 3.0352 3.8163 3.8874 3.9967 3.9293 3.9252 3.4455 3.8653 3.9896 3.9113 3.9471 4.0412 4.0180 4.0501 3.8891 4.0517 0.9927 0.9911 0.9962 0.9983 1.0126 1.0093 1.0164 1.0084 1.0258 1.0367 1.0036 1.0014 1.0008 1.0231 1.0032 1.0013 0.9960
dispcorr: -0.024535740 hartree
energy: -1817.066168553404
dipole: -25.38214 23.20613 -2.17601 9.25716 -8.75054 0.50662 -10.21587 9.89316 -0.32271
magnitude: 2.25740 au
magnitude: 5.73785 debye
