program: Orca
programVersion: 4.2.1
elementType: Cl Cl O O N N N C C C C C C C C C C C C C C C H H H H H H H H H H H H H H H H H
charge: 0
multiplicity: 1
keywords: wb97x-d3
keywords: def2-TZVPP
keywords: def2/J RIJCOSX GRIDX6 NOFINALGRIDX
keywords: grid4 nofinalgrid
keywords: scfconv7
keywords: smallprint printgap noloewdin
keywords: NOSOSCF
formula: C15H17Cl2N3O2
InChI: InChI=1S/C15H17Cl2N3O2/c1-2-3-12-7-21-15(22-12,8-20-10-18-9-19-20)13-5-4-11(16)6-14(13)17/h4-6,9-10,12H,2-3,7-8H2,1H3
39 atoms
Cl 0.373332 -1.152479 2.408848
Cl 1.1198 -5.377904 -0.749025
O  -0.69777 0.925724 0.644892
O  0.024338 1.145001 -1.458003
N  1.517389 2.666319 0.38983
N  1.823642 3.496696 -0.608783
N  0.973239 4.63371 1.122025
C  0.349175 0.597678 -0.220927
C  -1.803301 1.451815 -0.091822
C  -1.388525 1.181712 -1.534435
C  -3.088451 0.788864 0.373515
C  1.655269 1.241827 0.258596
C  0.526203 -0.91743 -0.314045
C  -4.3614 1.520299 -0.04304
C  0.545778 -1.759798 0.796613
C  0.721032 -1.504528 -1.56092
C  -4.607081 1.607952 -1.54266
C  0.726724 -3.129425 0.671895
C  0.90164 -2.868341 -1.714835
C  1.004873 3.356353 1.412598
C  0.898013 -3.672267 -0.589203
C  1.487447 4.663207 -0.124454
H  -1.859011 2.532378 0.092404
H  -1.7910 0.229335 -1.901981
H  -1.668875 1.969946 -2.23048
H  -3.064644 0.746231 1.465197
H  -3.113815 -0.248244 0.023168
H  2.45712 1.035974 -0.448789
H  1.950403 0.825358 1.220356
H  -4.352122 2.528106 0.382859
H  -5.206262 1.00745 0.422607
H  0.732707 -0.882116 -2.444816
H  -3.870082 2.231963 -2.05015
H  -4.591822 0.622548 -2.01298
H  -5.583104 2.050347 -1.747737
H  0.734308 -3.760052 1.550136
H  1.043786 -3.290254 -2.699995
H  0.68397 2.895355 2.333236
H  1.618513 5.573609 -0.688705
elementType: Cl O N C H
totalener: -1817.04326007 hartree
nucrepener: 2163.60849787 hartree
electener: -3980.65175794 hartree
oneelecener: -6792.40589058 hartree
twoeener: 2811.75413264 hartree
cpcmener: -0.02337786 hartree
kineticenergy: 1811.91431064 hartree
xcener: -128.815197525395 hartree
chargesum: 0.0000000
charge: -0.074966 -0.082425 -0.374228 -0.374891 0.133832 -0.349145 -0.412414 0.579384 0.170994 -0.041509 -0.140969 -0.123942 -0.092944 -0.106153 -0.050852 -0.140612 -0.285711 -0.144716 -0.181337 0.055558 0.112001 0.056585 0.085296 0.100579 0.117297 0.073046 0.067821 0.129976 0.149208 0.059815 0.072692 0.152234 0.081612 0.086345 0.098301 0.121562 0.146145 0.165763 0.160768
qa: -0.0750 -0.0824 -0.3742 -0.3749 0.1338 -0.3491 -0.4124 0.5794 0.1710 -0.0415 -0.1410 -0.1239 -0.0929 -0.1062 -0.0509 -0.1406 -0.2857 -0.1447 -0.1813 0.0556 0.1120 0.0566 0.0853 0.1006 0.1173 0.0730 0.0678 0.1300 0.1492 0.0598 0.0727 0.1522 0.0816 0.0863 0.0983 0.1216 0.1461 0.1658 0.1608
va: 1.2426 1.2217 2.0084 2.0113 3.3611 2.8954 3.0263 3.8877 3.8107 3.9375 3.9507 3.7907 3.5770 3.9103 4.0356 3.9227 3.9242 4.0773 4.0446 4.0652 3.8662 4.0534 0.9963 0.9945 1.0035 1.0201 1.0092 1.0257 1.0123 1.0088 1.0069 1.0220 1.0026 1.0011 1.0047 1.0256 1.0067 1.0050 0.9951
dispcorr: -0.021818615 hartree
energy: -1817.065078687182
dipole: -26.24078 25.26402 -0.97677 23.93921 -25.04645 -1.10724 -10.38990 9.85911 -0.53079
magnitude: 1.56901 au
magnitude: 3.98811 debye
