program: Gaussian 09
title: 000030596
version: EM64L-G09RevD.01
frameworkgroup: C1[X(C21H26N2O5)]
method: RPBEPBE
basis: SDD
operation: Freq
keyword: #p
keyword: freq=noraman
keyword: PBEPBE/SDD
title: #p freq=noraman PBEPBE/SDD
converged: YES YES NO NO
title: Mulliken charges:
elementType: O O O O O N N C C C C C C C C C C C C C C C C C C C C C H H H H H H H H H H H H H H H H H H H H H H H H H H
charge: -0.312353 -0.224619 -0.235807 -0.208065 -0.260157 -0.252144 -0.380661 0.008113 -0.436278 -0.419526 -0.012881 -0.453120 -0.468468 -0.325173 0.217146 0.212583 -0.420439 0.124812 -0.348119 0.204520 -0.350567 0.222062 -0.694591 -0.346982 -0.344468 -0.222460 -0.226892 -0.224031 0.250922 0.203394 0.266313 0.262859 0.207405 0.260956 0.223404 0.205264 0.241358 0.213425 0.289376 0.239411 0.242120 0.363530 0.203534 0.206805 0.199089 0.200147 0.221182 0.212576 0.210271 0.268306 0.290252 0.232293 0.233324 0.231047
chargesum: 0.00000
title: Mulliken charges with hydrogens summed into heavy atoms:
elementType: O O O O O N N C C C C C C C C C C C C C C C C C C C C C
charge: -0.312353 -0.224619 -0.235807 -0.208065 -0.260157 -0.252144 -0.017130 0.259034 0.033428 0.050738 0.248075 -0.024452 -0.013686 -0.035796 0.217146 0.212583 0.061093 0.124812 0.062220 0.204520 0.048669 0.222062 -0.050561 -0.078676 -0.054215 0.009834 0.006432 0.007016
polarizability: 2.94267286e+02 7.34838515e+00 2.74475610e+02 4.18280774e+00 -2.68018992e+01 1.83076125e+02
1716.lowfreq: -3.2221 -0.0005 -0.0004 0.0005 7.4557 10.9612 13.0779 14.7881 20.9724
frequency: 12.7648 14.7171 20.9375 31.2514 37.3584 49.8495 58.5767 64.5715 71.2148 82.7525 107.9390 121.5236 137.1839 151.5315 159.0224 172.5462 197.4017 208.1700 213.6373 226.5519 246.7561 268.2448 282.8558 303.2055 356.1137 359.4892 382.4624 386.4810 391.4066 405.4412 409.7956 435.3147 442.4516 456.4391 471.5553 489.9919 492.7392 515.0026 595.0829 613.4255 627.0827 649.2268 658.7982 667.7208 680.6447 704.5488 707.9039 730.8994 732.6103 767.2713 782.7429 785.3898 792.9884 795.8700 801.9958 838.4199 845.0682 868.0505 873.5821 903.9541 905.4908 919.5397 921.3675 947.0788 957.8901 970.2350 986.3706 989.3919 998.8354 1010.3182 1019.7455 1031.9119 1051.0469 1056.3102 1059.7144 1070.5821 1082.9035 1088.0347 1089.5306 1090.3335 1102.1365 1126.0013 1126.8069 1167.5318 1173.4420 1184.0633 1186.3729 1199.6753 1205.4246 1225.8323 1238.4019 1241.1022 1269.2425 1272.8177 1279.0619 1293.7868 1303.8686 1311.9404 1316.5858 1317.3163 1321.9693 1329.0265 1339.8753 1342.9074 1348.7053 1355.9413 1358.5303 1359.4779 1360.4617 1374.8617 1388.4880 1392.1483 1398.8843 1437.3421 1453.3724 1455.7246 1465.1063 1465.8467 1467.9106 1475.6850 1477.6322 1479.1047 1480.5112 1486.1943 1583.4766 1588.1541 1610.4439 1617.8073 1646.7682 1651.8424 2959.6206 2972.0589 2975.4450 2983.6622 2988.5270 3002.2873 3003.5301 3005.1416 3008.8947 3025.6002 3027.6437 3029.7878 3043.6218 3053.8355 3057.6137 3069.7168 3074.1205 3076.0394 3088.4690 3095.0572 3128.6489 3141.8130 3153.8770 3164.9647 3174.0006 3516.0027
redmass: 4.7766 5.9661 5.4077 4.2310 8.6320 1.5273 5.0463 5.5250 5.3324 4.9133 4.4098 2.6198 7.0717 8.0740 4.7681 4.6437 3.9315 3.8160 2.5574 1.1986 3.1219 2.7441 4.8443 3.4767 4.9508 3.8004 3.9447 3.6776 3.5278 2.8728 8.4879 3.9865 4.2881 2.8104 4.3593 6.4752 3.9909 5.7727 9.2407 6.4398 4.2234 4.5779 5.7924 2.9301 5.1210 1.6081 5.2580 1.1592 3.8326 1.6835 1.7905 1.5713 2.1380 2.3217 3.7083 3.2713 3.4629 1.2437 2.3152 2.8506 1.8422 2.1835 2.1025 1.4164 1.4153 1.8583 2.6480 5.7403 1.3899 1.3318 2.7680 3.6781 2.2552 2.5766 3.1005 2.8199 3.6516 1.7744 1.5108 1.4073 1.9423 2.2584 1.8608 1.7401 1.0601 1.1917 1.3947 2.2383 1.5630 1.4403 2.7059 1.6122 1.4382 1.3232 1.2953 1.2373 1.3366 1.3592 1.4348 1.8070 1.5188 1.7418 1.5053 1.9070 1.7260 1.5364 1.4422 1.5563 1.6676 1.7425 9.8110 1.2143 1.6275 2.2442 1.0855 1.0863 1.0772 1.0857 1.0818 1.0667 2.1815 1.0430 1.1124 1.0811 6.7861 9.8914 6.1827 10.0165 5.7126 9.7337 1.0584 1.0593 1.0363 1.0637 1.0632 1.0986 1.0599 1.0661 1.0652 1.0843 1.0819 1.1035 1.0871 1.0979 1.0987 1.1027 1.1028 1.0992 1.0987 1.0969 1.0854 1.0890 1.0936 1.0971 1.0996 1.0767
irintensity: 0.2381 0.4351 0.2791 0.7352 0.7464 0.0540 2.2055 0.0564 0.1330 0.7982 2.7711 0.0360 0.0598 8.7697 0.5196 0.9053 0.8987 3.3286 1.4302 0.3499 0.4236 0.2984 24.4381 13.4252 8.0951 9.5700 0.5942 4.2111 1.2738 0.2730 5.3807 0.3116 8.2429 8.2727 3.1596 16.3056 2.7467 22.3808 0.6047 0.1072 13.8981 1.3880 4.4443 12.6411 11.8354 86.6270 0.7928 8.8796 3.7550 34.5567 42.1357 36.9086 8.2471 20.3106 1.4211 11.5436 0.2264 0.1703 1.2815 19.4341 11.2328 11.1494 9.5763 11.2018 4.8936 0.4215 57.9301 1.2444 0.6065 0.6389 76.9804 11.8217 18.2962 117.1887 165.3204 8.9260 11.9616 17.2710 2.1854 2.6542 4.4498 2.6655 1.5743 9.0014 1.7132 10.6415 65.7071 52.3545 0.2130 27.3250 414.8718 18.1808 10.1290 3.4805 4.3016 40.3952 63.0225 1.5065 39.5292 144.7604 42.3054 4.2772 29.9928 145.7954 85.8269 26.6295 5.6777 19.5379 24.1022 2.7479 3.1072 11.2483 27.2175 19.3222 12.1585 20.4832 0.6968 14.9890 7.8801 5.1490 4.9008 12.1170 6.7885 17.1690 41.6693 384.0462 10.1700 174.3889 399.8353 123.3935 6.2533 49.6546 29.1397 7.1592 46.3495 3.1899 26.9050 52.6866 23.8581 7.9181 1.7562 23.7960 28.5514 27.9597 15.4096 8.3992 80.8690 48.1185 4.8986 19.0047 0.7529 13.8319 15.1442 13.6121 15.8578 69.3432
temp: 298.150 k
press: 1.00000 atm
elementType: 8 8 8 8 8 7 7 6 6 6 6 6 6 6 6 6 6 6 6 6 6 6 6 6 6 6 6 6 1 1 1 1 1 1 1 1 1 1 1 1 1 1 1 1 1 1 1 1 1 1 1 1 1 1
symmnumber: 1
zpe: 1159066.3 jmol-1
zpe.correction: 0.441465 hartree
zpe.thermalcorrener: 0.468135 hartree
zpe.thermalcorrenthalpy: 0.469079 hartree
zpe.thermalcorrgfe: 0.380348 hartree
zpe.sumelectzpe: -1299.444363 hartree
zpe.sumelectthermal: -1299.417692 hartree
zpe.sumelectthermalent: -1299.416748 hartree
zpe.sumelectthermalfe: -1299.505480 hartree
dipole: -1.1195 1.6611 1.0593
dipole: 2.2660
quadrupole: -180.6510 -161.5521 -166.6136
quadrupole: 7.9812 -10.9533 0.4050
quadrupole: -11.0454 8.0535 2.9919 7.9812 -10.9533 0.4050
hfenergy: -1299.8858276 hartree
pointgroup: C01 [X(C21H26N2O5)]
dipole: 0.4182411 0.6964193 -0.3672212 debye
polarizability: 294.1799661|-5.2941001|267.006551|-3.8569267|37.1868759|190.6325042 unknown
InChI: InChI=1S/C21H26N2O5/c1-2-3-9-17-18(24)22-21(27)23(19(17)25)15-10-12-16(13-11-15)28-20(26)14-7-5-4-6-8-14/h4-8,15-17,22H,2-3,9-13H2,1H3
charge 0 multiplicity 1
54 atoms
O  -2.692223 -0.715976 -0.592666
O  0.5732 0.780642 0.890146
O  3.129318 -3.010318 -0.1744
O  5.214221 0.405994 2.15093
O  -4.853277 -1.549755 -0.288587
N  1.813541 -1.106423 0.278439
N  4.111977 -1.258781 0.975808
C  0.620898 -1.786778 -0.350328
C  0.055353 -0.970305 -1.539048
C  -0.452673 -2.130539 0.712774
C  -2.224136 -2.039192 -1.123452
C  -1.148189 -1.710585 -2.169967
C  -1.650034 -2.854032 0.053524
C  2.940206 0.881367 1.372789
C  1.683988 0.184054 0.845781
C  3.018198 -1.857987 0.319243
C  3.282082 2.123325 0.472892
C  4.17753 0.016899 1.554148
C  3.669897 1.778291 -0.981203
C  -4.015343 -0.622203 -0.15249
C  4.017103 3.043785 -1.798722
C  -4.285605 0.702379 0.480502
C  4.399694 2.726074 -3.259935
C  -5.629846 1.030293 0.79628
C  -3.238925 1.611175 0.791412
C  -5.929385 2.264485 1.408118
C  -3.54559 2.842173 1.409542
C  -4.887481 3.172779 1.715283
H  1.029819 -2.735018 -0.745461
H  0.847741 -0.827098 -2.298325
H  -0.274621 0.021965 -1.193112
H  -0.805538 -1.205691 1.197527
H  -0.007115 -2.778591 1.490885
H  -3.095293 -2.552424 -1.569133
H  -1.587669 -1.093184 -2.973983
H  -0.819496 -2.664668 -2.629215
H  -2.442932 -3.040434 0.80023
H  -1.336025 -3.842548 -0.338953
H  2.677922 1.284328 2.369262
H  2.396274 2.785035 0.482667
H  4.113466 2.65957 0.967263
H  4.948846 -1.848573 1.038332
H  2.836612 1.243576 -1.481912
H  4.542375 1.093249 -0.991099
H  3.150594 3.735608 -1.783143
H  4.85295 3.577871 -1.303226
H  4.640178 3.647143 -3.821273
H  5.284162 2.063209 -3.304936
H  3.570731 2.216866 -3.786684
H  -6.416663 0.307212 0.556721
H  -2.202957 1.344389 0.561571
H  -6.967559 2.51887 1.647595
H  -2.738828 3.540875 1.655966
H  -5.119972 4.13082 2.194126
