program: Gaussian 09
title: 000003259
version: EM64L-G09RevD.01
frameworkgroup: C1[X(C20H8I4O5)]
method: RPBEPBE
basis: SDD
operation: Freq
keyword: #p
keyword: freq=noraman
keyword: PBEPBE/SDD
title: #p freq=noraman PBEPBE/SDD
converged: YES YES NO NO
title: Mulliken charges:
elementType: I I I I O O O O O C C C C C C C C C C C C C C C C C C C C H H H H H H H H
charge: 0.186173 0.197503 0.162312 0.144966 -0.221691 -0.264736 -0.198330 -0.382464 -0.383325 -0.096755 0.278769 0.408258 0.404592 0.094249 0.323222 0.327650 0.098349 -0.387209 -0.273841 -0.284067 -0.376187 -0.786879 -0.756473 -0.657055 -0.659104 -0.213123 0.645713 0.638290 -0.218671 0.269630 0.268478 0.260733 0.273769 0.239186 0.240963 0.346256 0.350850
chargesum: 0.00000
title: Mulliken charges with hydrogens summed into heavy atoms:
elementType: I I I I O O O O O C C C C C C C C C C C C C C C C C C C C
charge: 0.186173 0.197503 0.162312 0.144966 -0.221691 -0.264736 -0.198330 -0.036208 -0.032475 -0.096755 0.278769 0.408258 0.404592 0.094249 0.323222 0.327650 0.098349 -0.126476 -0.004211 -0.015588 -0.102418 -0.786879 -0.756473 -0.657055 -0.659104 0.026063 0.645713 0.638290 0.022292
polarizability: 4.29545137e+02 6.09318239e-01 4.45036515e+02 -5.97858798e-01 1.94703352e+00 1.71320339e+02
1716.lowfreq: -5.8121 -0.0005 -0.0003 0.0001 1.5238 5.3644 7.5232 18.1942 37.7900
frequency: 6.7811 18.1805 37.7856 42.5136 46.0114 49.5273 74.0861 75.5491 78.1478 90.6971 105.4680 130.6375 132.4016 135.8258 141.6620 155.8495 195.6718 204.4192 241.2951 248.8817 250.0315 266.5735 267.6585 270.9443 315.8361 327.5449 366.0095 387.4687 393.4307 404.8101 417.6955 446.6474 470.7815 484.1298 497.7639 514.2087 532.8701 547.1965 551.0225 557.4733 606.8294 620.8944 641.7413 650.7779 658.0866 664.9731 671.0134 693.9908 711.8394 749.1348 750.5038 754.6012 763.1076 771.1814 775.8745 786.5170 805.0531 890.0950 893.3969 905.2176 927.6336 948.8329 969.2135 971.9098 997.4159 1005.6675 1024.4654 1027.4101 1085.4254 1131.1169 1142.7730 1158.0529 1172.6054 1193.3868 1203.5080 1228.7365 1239.1027 1249.1758 1276.0782 1278.0912 1311.2360 1376.0222 1383.2338 1388.9403 1400.5574 1407.5583 1443.5288 1445.9650 1449.9298 1461.5484 1535.9949 1560.2040 1587.1552 1603.7160 1605.9226 1615.0032 1692.6766 3137.3164 3148.1732 3159.1821 3166.3528 3168.9571 3173.1968 3418.1513 3443.6663
redmass: 13.9507 76.9522 7.9330 10.2713 6.9272 49.2999 10.4672 38.1631 10.5174 51.3923 15.7511 10.8024 6.0666 7.5864 16.3897 16.5331 15.9399 8.6183 9.4782 7.2797 9.2606 6.5594 8.6400 7.7236 7.9271 8.3011 9.2237 8.7250 6.7518 7.8331 3.5530 1.1240 1.1291 4.7412 6.7032 5.5245 4.8944 5.9013 7.1531 7.9629 10.0928 6.2259 10.6784 10.4349 10.5791 4.8979 9.0147 9.2857 7.9308 8.3045 7.9349 5.6511 6.3016 5.2138 10.0595 1.5825 5.3438 1.4214 1.4392 1.5024 8.3669 6.2753 7.9384 1.4761 5.9359 1.3379 5.1591 2.4236 2.9438 2.8982 2.1004 2.1216 1.1168 3.0036 2.3952 1.6292 1.9857 2.6872 2.4407 2.3827 3.8509 6.3476 8.6140 6.2527 8.8045 6.7186 4.9504 4.3297 2.5366 2.6494 7.5970 8.5724 8.6353 8.7350 7.9106 7.3136 12.9973 1.0867 1.0903 1.0953 1.0919 1.0921 1.1004 1.0647 1.0649
irintensity: 0.2750 0.0644 0.1227 0.9597 2.7996 0.0130 0.0782 0.0590 0.0814 0.2790 0.3791 0.8332 0.5475 0.1795 0.6700 0.0206 0.0485 1.9576 2.0003 3.8196 3.5451 2.2111 2.5390 6.3495 3.6071 11.7370 0.5382 6.7781 5.1718 5.1814 1.1488 115.1512 125.1451 5.9686 8.2514 12.0233 1.4016 51.3034 12.7055 10.6375 0.9694 23.3234 10.9494 0.7865 15.7254 33.4131 19.5675 9.0389 43.3161 13.5743 8.9800 3.9531 4.1169 7.9342 124.9673 38.7281 82.5259 5.0443 5.3470 10.1213 57.0845 61.6888 12.2322 11.0682 111.1898 0.0062 13.3794 37.6860 40.0403 17.6586 39.9406 573.6855 16.8959 114.4556 226.5667 49.7371 3.2196 93.0240 42.7671 29.3091 39.5974 158.7478 6.8165 414.9242 3.6589 147.5594 42.5703 108.2964 25.0972 4.5271 7.7811 13.8829 81.1098 22.2735 8.7348 12.0700 394.8506 0.7299 5.6203 6.7159 0.1681 0.0129 19.9334 74.3098 102.4861
temp: 298.150 k
press: 1.00000 atm
elementType: 53 53 53 53 8 8 8 8 8 6 6 6 6 6 6 6 6 6 6 6 6 6 6 6 6 6 6 6 6 1 1 1 1 1 1 1 1
symmnumber: 1
zpe: 589526.3 jmol-1
zpe.correction: 0.224539 hartree
zpe.thermalcorrener: 0.250700 hartree
zpe.thermalcorrenthalpy: 0.251644 hartree
zpe.thermalcorrgfe: 0.161800 hartree
zpe.sumelectzpe: -1187.089981 hartree
zpe.sumelectthermal: -1187.063820 hartree
zpe.sumelectthermalent: -1187.062876 hartree
zpe.sumelectthermalfe: -1187.152719 hartree
dipole: -1.8517 1.1739 -5.6267
dipole: 6.0387
quadrupole: -213.4086 -198.0553 -237.1060
quadrupole: -11.4016 0.8238 -19.9894
quadrupole: 2.7813 18.1347 -20.9160 -11.4016 0.8238 -19.9894
hfenergy: -1187.3145197 hartree
pointgroup: C01 [X(C20H8I4O5)]
dipole: -0.7529395 0.274576 -2.236558 debye
polarizability: 429.4996046|0.3843211|443.3542873|-3.7360547|-21.440986|173.0480996 unknown
InChI: InChI=1S/C20H8I4O5/c21-11-5-9-17(13(23)15(11)25)28-18-10(6-12(22)16(26)14(18)24)20(9)8-4-2-1-3-7(8)19(27)29-20/h1-6,25-26H
charge 0 multiplicity 1
37 atoms
I  2.252594 -4.565593 0.303937
I  -2.307711 -4.546167 0.348299
I  5.592884 0.55474 -0.351261
I  -5.603532 0.613274 -0.217628
O  0.016286 1.159181 1.70013
O  -0.011386 -2.353114 0.322208
O  0.021117 3.267968 2.713639
O  4.828816 -2.520263 -0.051175
O  -4.785649 -2.592668 0.063917
C  0.002868 0.596602 0.248886
C  -0.001013 1.875143 -0.587973
C  1.2535 -0.244637 0.092359
C  -1.258449 -0.235729 0.11756
C  0.006207 3.00886 0.247999
C  1.195865 -1.654468 0.189528
C  -1.21888 -1.648946 0.213108
C  0.015453 2.584097 1.675896
C  -0.008511 2.014919 -1.987121
C  2.522985 0.363374 -0.062542
C  -2.520582 0.389117 -0.007688
C  0.005671 4.318041 -0.2742
C  2.372504 -2.435669 0.148495
C  -2.398373 -2.429416 0.197805
C  3.697633 -0.397619 -0.113043
C  -3.696534 -0.369599 -0.030107
C  -0.009197 3.325137 -2.524804
C  3.640127 -1.816324 -0.00098
C  -3.657971 -1.791337 0.077491
C  -0.002395 4.466598 -1.679194
H  2.58362 1.452661 -0.133694
H  -2.569424 1.478924 -0.074371
H  -0.011742 1.138833 -2.643922
H  0.012577 5.180425 0.400034
H  -0.013633 3.461934 -3.611599
H  -0.002004 5.467311 -2.123731
H  4.662869 -3.500105 0.041158
H  -5.612491 -2.041882 -0.017017
