program: Gaussian 09
title: 000030598
version: EM64L-G09RevD.01
frameworkgroup: C1[X(C14H17ClN2O)]
method: RPBEPBE
basis: SDD
operation: Freq
keyword: #p
keyword: freq=noraman
keyword: PBEPBE/SDD
title: #p freq=noraman PBEPBE/SDD
converged: YES YES NO NO
title: Mulliken charges:
elementType: Cl O N N C C C C C C C C C C C C C C H H H H H H H H H H H H H H H H H
charge: -0.068005 -0.225434 -0.107928 -0.460922 -0.500966 -0.416492 -0.406582 0.190309 0.514109 -0.058504 -0.064368 -0.438954 -0.358890 -0.042685 -0.191294 -0.257578 -0.583580 -0.583025 0.194747 0.272246 0.190225 0.240301 0.186540 0.239046 0.308730 0.253920 0.248709 0.248956 0.311633 0.233701 0.257943 0.218848 0.216862 0.220461 0.217921
chargesum: 0.00000
title: Mulliken charges with hydrogens summed into heavy atoms:
elementType: Cl O N N C C C C C C C C C C C C C C
charge: -0.068005 -0.225434 -0.107928 -0.152192 -0.033973 0.014034 0.019004 0.190309 0.514109 0.195416 0.184342 -0.189998 -0.047257 -0.042685 0.042407 0.000365 -0.147870 -0.144643
polarizability: 2.59490124e+02 1.00016138e+01 1.70038386e+02 3.35877282e-02 -2.12648655e+01 1.30662451e+02
1716.lowfreq: -5.1170 -0.0012 0.0010 0.0017 2.6279 4.0870 12.2490 29.4444 34.5901
frequency: 11.7225 29.4348 34.5673 60.5872 66.7541 77.3210 82.9346 91.5127 104.9596 159.7138 183.3803 196.2938 209.3754 236.3838 247.4591 274.8084 335.4599 360.7919 370.3056 381.0863 407.9449 437.1121 447.0325 461.8736 549.0055 572.8983 584.7962 627.9408 647.0982 654.2459 667.2127 686.0765 744.0356 790.2953 829.9650 861.4284 862.6129 900.4247 913.5430 917.0771 943.0574 947.8819 951.3996 959.2751 978.2408 979.7283 989.4409 993.7177 1016.3885 1020.5037 1071.5162 1096.0828 1117.2694 1124.3506 1146.6098 1155.0849 1175.8536 1179.7860 1236.3107 1249.6910 1263.9767 1265.4327 1276.4190 1278.3246 1303.0755 1349.5233 1356.0763 1360.0886 1372.2576 1409.7547 1425.1822 1427.4582 1451.3280 1455.0062 1468.0693 1472.8156 1507.3945 1584.4753 1612.3778 1640.2569 1654.8047 1657.3718 2781.1879 2853.0422 2866.1606 2995.7048 3006.5657 3023.8369 3084.9934 3085.0950 3108.0572 3112.8008 3141.7538 3147.4658 3178.9721 3195.5622 3196.1771 3202.1814 3507.9505
redmass: 6.1793 4.3020 4.3977 7.2766 3.6949 3.0269 3.8674 2.1746 3.3720 4.4701 5.4762 3.4701 2.2860 5.2338 4.2222 3.0192 4.8792 5.6709 2.5209 2.2805 8.3104 3.0129 2.3978 2.2967 3.8764 2.9609 2.8690 2.2145 1.2898 1.7744 5.1114 2.2756 4.9029 1.3152 3.9539 1.6127 4.0275 1.4942 1.3716 2.2389 2.0736 1.5670 1.3430 1.8255 5.8759 2.2244 1.9638 1.3183 1.1921 1.2015 2.0831 1.5540 2.1300 2.1242 2.2899 2.4525 1.4049 1.5414 1.1474 1.7272 1.3403 1.4309 1.2641 1.2529 1.5931 1.4724 1.5578 1.4779 3.0297 3.4815 1.1967 1.2071 1.0990 1.0969 1.0889 2.6628 2.1440 5.3910 6.3769 5.5081 4.6872 4.7302 1.0707 1.0708 1.0700 1.0829 1.0867 1.0869 1.0600 1.0600 1.0942 1.0943 1.0925 1.0889 1.0958 1.1139 1.1140 1.0954 1.0758
irintensity: 0.0106 0.1092 0.1003 5.6412 0.1526 0.6338 3.4458 0.9015 1.3812 2.8106 0.6690 1.0844 4.8299 4.2348 1.0886 2.4248 5.8450 7.4549 4.1723 0.9215 5.5408 6.2062 3.0394 8.6213 6.7174 23.6120 2.9664 0.8717 60.5262 15.2678 17.7308 23.7439 5.6625 51.6853 14.9437 40.6462 30.0991 6.2012 3.9370 1.5882 12.4253 32.4845 125.9896 8.5226 14.6731 33.6965 33.8028 3.2898 18.4287 21.1753 27.8301 22.9873 39.0079 52.7862 116.4758 78.0156 2.1945 3.1521 4.7313 18.8944 14.3730 38.5546 17.9378 9.5546 43.3058 19.8911 25.0075 2.3097 92.3644 49.4895 15.6600 18.1227 4.3095 5.0772 4.3248 173.4724 295.3170 199.1911 115.2266 94.1088 8.3618 8.8437 126.5588 53.5153 144.7383 19.6104 12.3141 10.5500 6.9014 15.7755 6.8273 6.1642 5.7224 8.6146 2.9004 21.6151 30.0580 7.8284 10.1835
temp: 298.150 k
press: 1.00000 atm
elementType: 17 8 7 7 6 6 6 6 6 6 6 6 6 6 6 6 6 6 1 1 1 1 1 1 1 1 1 1 1 1 1 1 1 1 1
symmnumber: 1
zpe: 732644.7 jmol-1
zpe.correction: 0.279050 hartree
zpe.thermalcorrener: 0.297937 hartree
zpe.thermalcorrenthalpy: 0.298881 hartree
zpe.thermalcorrgfe: 0.228320 hartree
zpe.sumelectzpe: -1187.085566 hartree
zpe.sumelectthermal: -1187.066678 hartree
zpe.sumelectthermalent: -1187.065734 hartree
zpe.sumelectthermalfe: -1187.136296 hartree
dipole: -1.4462 1.6867 -1.8374
dipole: 2.8831
quadrupole: -121.2101 -111.6912 -112.4515
quadrupole: -6.5088 8.4165 -3.3827
quadrupole: -6.0925 3.4264 2.6661 -6.5088 8.4165 -3.3827
hfenergy: -1187.3646155 hartree
pointgroup: C01 [X(C14H17Cl1N2O1)]
dipole: 0.6160676 0.5550951 0.7739547 debye
polarizability: 257.3348691|-17.1647913|168.4527186|0.9415813|24.2121442|134.4033735 unknown
InChI: InChI=1S/C14H17ClN2O/c1-3-8-17(9-4-2)11-14(18)16-13-7-5-6-12(15)10-13/h3-7,10,16H,1-2,8-9,11H2
charge 0 multiplicity 1
35 atoms
Cl -6.018539 1.42568 1.168176
O  0.299051 -0.938721 -1.055885
N  2.713251 -0.050878 0.226455
N  -0.975706 0.45398 0.343151
C  1.456886 0.651012 0.465582
C  2.81616 -1.377416 0.883663
C  3.913661 0.805379 0.391895
C  0.229096 -0.046117 -0.167998
C  -2.307147 0.135076 -0.041013
C  3.876598 -2.244264 0.237468
C  3.97077 1.907828 -0.645443
C  -3.356239 0.817938 0.635175
C  -2.618329 -0.816156 -1.050685
C  -4.686583 0.536483 0.288406
C  -3.970248 -1.066611 -1.366834
C  -5.02765 -0.398489 -0.7067
C  4.856419 -2.901419 0.906903
C  4.170703 3.221594 -0.370782
H  1.243279 0.820594 1.558353
H  1.537474 1.657517 0.007889
H  3.011145 -1.292532 1.982401
H  1.839218 -1.8804 0.754237
H  3.988627 1.246885 1.418341
H  4.792574 0.143501 0.263948
H  -0.88717 1.150397 1.088683
H  3.787101 -2.334927 -0.854327
H  3.847365 1.570023 -1.684637
H  -3.136898 1.555416 1.415349
H  -1.808581 -1.336703 -1.563392
H  -4.20808 -1.799375 -2.145249
H  -6.073201 -0.596854 -0.956015
H  5.571995 -3.548148 0.387189
H  4.964833 -2.818356 1.996189
H  4.236958 3.971209 -1.167085
H  4.287006 3.581953 0.659695
