program: Orca
programVersion: 4.2.1
elementType: Cl Cl O O N N N C C C C C C C C C C C C C C C H H H H H H H H H H H H H H H H H
charge: 0
multiplicity: 1
keywords: wb97x-d3
keywords: def2-TZVPP
keywords: def2/J RIJCOSX GRIDX6 NOFINALGRIDX
keywords: grid4 nofinalgrid
keywords: scfconv7
keywords: smallprint printgap noloewdin
keywords: NOSOSCF
formula: C15H17Cl2N3O2
InChI: InChI=1S/C15H17Cl2N3O2/c1-2-3-12-7-21-15(22-12,8-20-10-18-9-19-20)13-5-4-11(16)6-14(13)17/h4-6,9-10,12H,2-3,7-8H2,1H3
39 atoms
Cl 2.149835 -0.732983 -1.801176
Cl 0.172393 -5.343802 -0.014088
O  -0.945578 1.148914 0.894624
O  0.130484 1.241837 -1.076574
N  1.560822 2.612297 0.895462
N  0.955882 3.429577 1.762693
N  1.958436 4.611177 0.139837
C  0.18074 0.696011 0.208722
C  -1.846145 1.763364 -0.014136
C  -0.9088 2.197637 -1.133809
C  -2.946893 0.81826 -0.471891
C  1.427076 1.185839 0.970741
C  0.206421 -0.826153 0.123968
C  -3.870457 0.35355 0.646633
C  1.037191 -1.531885 -0.745072
C  -0.604872 -1.571363 0.973193
C  -4.902408 -0.652407 0.158697
C  1.028448 -2.918124 -0.793605
C  -0.628063 -2.954635 0.947097
C  2.146747 3.334489 -0.071976
C  0.188101 -3.621407 0.050744
C  1.22317 4.615142 1.273256
H  -2.281662 2.623763 0.501308
H  -1.368812 2.151402 -2.122257
H  -0.526708 3.211919 -0.9768
H  -2.505054 -0.045825 -0.979965
H  -3.54296 1.340016 -1.228365
H  2.325067 0.732585 0.552135
H  1.357767 0.893773 2.017702
H  -4.375657 1.22037 1.082821
H  -3.286243 -0.089466 1.45572
H  -1.241924 -1.053243 1.675053
H  -5.567391 -0.965172 0.963604
H  -5.522278 -0.234185 -0.635948
H  -4.42063 -1.547431 -0.238507
H  1.674054 -3.439757 -1.485576
H  -1.274396 -3.504586 1.616291
H  2.688612 2.889046 -0.891887
H  0.885678 5.518781 1.756419
totalener: -1817.01741637 hartree
nucrepener: 2182.13268046 hartree
electener: -3999.15009683 hartree
oneelecener: -6829.29686948 hartree
twoeener: 2830.14677265 hartree
kineticenergy: 1811.92023023 hartree
xcener: -128.815642538608 hartree
chargesum: -0.0000000
charge: -0.059630 -0.064692 -0.357092 -0.344615 0.116878 -0.302952 -0.331280 0.554686 0.199840 -0.024771 -0.229187 -0.162541 -0.073416 -0.089310 -0.043884 -0.137521 -0.260206 -0.149716 -0.168728 0.035260 0.107564 0.050282 0.085863 0.085338 0.094104 0.085982 0.076371 0.135798 0.123466 0.066062 0.064276 0.165768 0.088124 0.075909 0.076680 0.114344 0.124063 0.141728 0.131153
qa: -0.0596 -0.0647 -0.3571 -0.3446 0.1169 -0.3030 -0.3313 0.5547 0.1998 -0.0248 -0.2292 -0.1625 -0.0734 -0.0893 -0.0439 -0.1375 -0.2602 -0.1497 -0.1687 0.0353 0.1076 0.0503 0.0859 0.0853 0.0941 0.0860 0.0764 0.1358 0.1235 0.0661 0.0643 0.1658 0.0881 0.0759 0.0767 0.1143 0.1241 0.1417 0.1312
va: 1.2615 1.2406 2.0390 2.0288 3.3480 2.8754 3.0537 3.8530 3.8628 4.0217 3.9308 3.8492 3.5067 3.8674 4.0526 3.9232 3.9478 4.0807 4.0690 4.0658 3.9264 4.0398 1.0031 1.0002 0.9915 1.0004 1.0162 1.0140 1.0265 1.0090 1.0188 1.0038 1.0057 1.0032 1.0033 1.0264 1.0158 1.0115 1.0024
dispcorr: -0.022797221 hartree
energy: -1817.040213592005
dipole: -28.63053 27.75685 -0.87368 17.64515 -18.28114 -0.63599 5.30202 -5.38733 -0.08531
magnitude: 1.08402 au
magnitude: 2.75535 debye
