program: Orca
programVersion: 4.2.1
elementType: Cl Cl O O N N N C C C C C C C C C C C C C C C H H H H H H H H H H H H H H H H H
charge: 0
multiplicity: 1
keywords: wb97x-d3
keywords: def2-TZVPP
keywords: def2/J RIJCOSX GRIDX6 NOFINALGRIDX
keywords: grid4 nofinalgrid
keywords: scfconv7
keywords: smallprint printgap noloewdin
keywords: NOSOSCF
formula: C15H17Cl2N3O2
InChI: InChI=1S/C15H17Cl2N3O2/c1-2-3-12-7-21-15(22-12,8-20-10-18-9-19-20)13-5-4-11(16)6-14(13)17/h4-6,9-10,12H,2-3,7-8H2,1H3
39 atoms
Cl 2.566933 -0.528212 -1.704487
Cl 1.227571 -5.517472 -0.413871
O  -1.198062 0.567628 0.523124
O  0.092943 1.040479 -1.25419
N  0.830348 2.492342 1.038766
N  0.043856 2.974236 2.006833
N  0.658988 4.616033 0.607027
C  0.080788 0.403976 -0.009888
C  -1.977305 1.382733 -0.341256
C  -1.247101 1.209235 -1.662315
C  -3.421403 0.930663 -0.328696
C  1.102378 1.088234 0.912911
C  0.392325 -1.083843 -0.135135
C  -4.064743 0.924633 1.057001
C  1.472544 -1.575092 -0.866964
C  -0.410409 -2.01519 0.516656
C  -3.993893 2.260515 1.784759
C  1.732898 -2.934425 -0.95748
C  -0.168403 -3.375666 0.444597
C  1.18074 3.485462 0.207247
C  0.906379 -3.827867 -0.300074
C  -0.027886 4.248863 1.710081
H  -1.910941 2.428014 -0.013444
H  -1.610481 0.331654 -2.213052
H  -1.307225 2.081486 -2.312561
H  -3.492646 -0.06856 -0.769412
H  -3.982402 1.602255 -0.98721
H  2.113847 0.954455 0.531464
H  1.05234 0.640653 1.904184
H  -3.596799 0.152283 1.671124
H  -5.109459 0.625721 0.942161
H  -1.253051 -1.666279 1.095549
H  -2.969405 2.524628 2.048929
H  -4.405149 3.070187 1.178425
H  -4.566181 2.225734 2.711845
H  2.573186 -3.287756 -1.537803
H  -0.811635 -4.074199 0.960605
H  1.809685 3.335212 -0.656147
H  -0.589029 4.942235 2.316862
totalener: -1817.01926366 hartree
nucrepener: 2176.14949146 hartree
electener: -3993.16875513 hartree
oneelecener: -6817.44433996 hartree
twoeener: 2824.27558483 hartree
kineticenergy: 1811.91701870 hartree
xcener: -128.815492260499 hartree
chargesum: -0.0000000
charge: -0.060401 -0.064420 -0.354316 -0.346778 0.113360 -0.318414 -0.327277 0.546750 0.084521 0.041720 -0.186502 -0.138658 -0.090990 -0.073728 -0.009849 -0.127926 -0.271675 -0.157657 -0.158384 0.035443 0.109127 0.057236 0.083203 0.071489 0.101244 0.064577 0.077869 0.135950 0.123171 0.062954 0.068166 0.141795 0.090003 0.077008 0.087177 0.113890 0.123931 0.144896 0.131495
qa: -0.0604 -0.0644 -0.3543 -0.3468 0.1134 -0.3184 -0.3273 0.5468 0.0845 0.0417 -0.1865 -0.1387 -0.0910 -0.0737 -0.0098 -0.1279 -0.2717 -0.1577 -0.1584 0.0354 0.1091 0.0572 0.0832 0.0715 0.1012 0.0646 0.0779 0.1359 0.1232 0.0630 0.0682 0.1418 0.0900 0.0770 0.0872 0.1139 0.1239 0.1449 0.1315
va: 1.2614 1.2410 2.0141 2.0071 3.3531 2.8325 3.0592 3.8814 3.9271 3.9638 3.9760 3.8200 3.5893 3.8745 4.0194 3.9635 3.9368 4.0902 4.0525 4.0786 3.9213 4.0242 0.9868 1.0090 0.9975 1.0197 1.0100 1.0200 1.0243 1.0134 1.0082 1.0194 1.0091 1.0015 1.0079 1.0279 1.0147 1.0100 1.0024
dispcorr: -0.022641261 hartree
energy: -1817.041904924650
dipole: -31.75749 31.10484 -0.65266 23.73218 -24.46151 -0.72933 9.46691 -9.81166 -0.34475
magnitude: 1.03766 au
magnitude: 2.63752 debye
