program: Orca
programVersion: 4.2.1
elementType: Cl Cl O O N N N C C C C C C C C C C C C C C C H H H H H H H H H H H H H H H H H
charge: 0
multiplicity: 1
keywords: wb97x-d3
keywords: def2-TZVPP
keywords: def2/J RIJCOSX GRIDX6 NOFINALGRIDX
keywords: grid4 nofinalgrid
keywords: scfconv7
keywords: smallprint printgap noloewdin
keywords: NOSOSCF
formula: C15H17Cl2N3O2
InChI: InChI=1S/C15H17Cl2N3O2/c1-2-3-12-7-21-15(22-12,8-20-10-18-9-19-20)13-5-4-11(16)6-14(13)17/h4-6,9-10,12H,2-3,7-8H2,1H3
39 atoms
Cl 1.683112 0.494026 -1.8161
Cl 1.413474 -4.487504 0.009178
O  -1.923109 1.16968 0.79905
O  -0.634612 1.92254 -0.842752
N  1.576195 2.185939 1.020684
N  2.518815 1.322951 1.413446
N  3.410051 2.92678 0.123456
C  -0.597259 1.209673 0.348225
C  -2.782032 1.207409 -0.336521
C  -1.816356 1.520301 -1.492822
C  -3.550041 -0.086525 -0.531849
C  0.199772 2.00897 1.383078
C  -0.054083 -0.213146 0.187772
C  -4.468427 -0.448697 0.627189
C  0.933972 -0.60204 -0.713885
C  -0.548451 -1.192796 1.0471
C  -5.204022 -1.759123 0.388579
C  1.379975 -1.916593 -0.774311
C  -0.112104 -2.503035 1.013189
C  2.125854 3.132953 0.245247
C  0.854431 -2.8586 0.088182
C  3.59898 1.805255 0.850684
H  -3.487749 2.030627 -0.178585
H  -1.644982 0.634843 -2.118473
H  -2.15683 2.332863 -2.134151
H  -2.845574 -0.903038 -0.719419
H  -4.145082 0.016521 -1.446719
H  0.166648 1.501322 2.345825
H  -0.268656 2.988101 1.494897
H  -5.1919 0.356417 0.787452
H  -3.885795 -0.518132 1.548716
H  -1.308928 -0.922588 1.76648
H  -4.504397 -2.58707 0.263604
H  -5.860476 -2.006378 1.222563
H  -5.819129 -1.712454 -0.511508
H  2.140838 -2.192951 -1.490008
H  -0.519277 -3.235447 1.695555
H  1.556024 3.933894 -0.199083
H  4.561389 1.335056 0.977015
totalener: -1817.01514495 hartree
nucrepener: 2221.42155768 hartree
electener: -4038.43670263 hartree
oneelecener: -6908.35578536 hartree
twoeener: 2869.91908273 hartree
kineticenergy: 1811.92903401 hartree
xcener: -128.817639035216 hartree
chargesum: -0.0000000
charge: -0.047943 -0.067886 -0.362302 -0.328478 0.094224 -0.309372 -0.323784 0.572651 0.186667 -0.038617 -0.231311 -0.080838 -0.039780 -0.080633 -0.063105 -0.233518 -0.257554 -0.111017 -0.139025 0.046204 0.087707 0.062788 0.083488 0.086618 0.095967 0.074209 0.086658 0.120144 0.111144 0.059598 0.064379 0.140269 0.077318 0.088394 0.073762 0.111372 0.122707 0.140069 0.128825
qa: -0.0479 -0.0679 -0.3623 -0.3285 0.0942 -0.3094 -0.3238 0.5727 0.1867 -0.0386 -0.2313 -0.0808 -0.0398 -0.0806 -0.0631 -0.2335 -0.2576 -0.1110 -0.1390 0.0462 0.0877 0.0628 0.0835 0.0866 0.0960 0.0742 0.0867 0.1201 0.1111 0.0596 0.0644 0.1403 0.0773 0.0884 0.0738 0.1114 0.1227 0.1401 0.1288
va: 1.2707 1.2385 2.0113 2.0325 3.3298 2.8448 3.0543 3.8381 3.8436 3.9896 3.9437 3.8724 3.4866 3.8663 4.0314 4.0284 3.9475 4.0328 4.0427 4.0880 3.9467 4.0518 0.9997 1.0012 0.9974 1.0024 1.0156 1.0157 1.0201 1.0092 1.0185 1.0128 1.0032 1.0061 1.0033 1.0275 1.0137 1.0092 1.0029
dispcorr: -0.023447164 hartree
energy: -1817.038592109419
dipole: -36.08794 34.01947 -2.06847 6.78812 -6.71546 0.07265 5.44607 -5.43713 0.00894
magnitude: 2.06976 au
magnitude: 5.26092 debye
