program: Orca
programVersion: 4.2.1
elementType: Cl Cl O O N N N C C C C C C C C C C C C C C C H H H H H H H H H H H H H H H H H
charge: 0
multiplicity: 1
keywords: wb97x-d3
keywords: def2-TZVPP
keywords: def2/J RIJCOSX GRIDX6 NOFINALGRIDX
keywords: grid4 nofinalgrid
keywords: scfconv7
keywords: smallprint printgap noloewdin
keywords: NOSOSCF
formula: C15H17Cl2N3O2
InChI: InChI=1S/C15H17Cl2N3O2/c1-2-3-12-7-21-15(22-12,8-20-10-18-9-19-20)13-5-4-11(16)6-14(13)17/h4-6,9-10,12H,2-3,7-8H2,1H3
39 atoms
Cl 2.521046 -0.721816 -1.589541
Cl 0.438045 -5.396682 -0.118196
O  -1.024418 1.041781 0.575872
O  0.342031 1.233729 -1.181442
N  1.271212 2.618879 1.095075
N  2.09324 3.383223 0.370271
N  0.671085 4.658907 1.54466
C  0.222781 0.647075 0.069431
C  -1.820628 1.574528 -0.479426
C  -0.958049 1.309781 -1.711134
C  -3.189599 0.928283 -0.52528
C  1.311493 1.187024 1.002589
C  0.299073 -0.879245 -0.001931
C  -4.031046 1.172326 0.721142
C  1.284868 -1.557272 -0.718996
C  -0.625858 -1.652573 0.693096
C  -5.406418 0.528647 0.626038
C  1.329918 -2.943491 -0.759538
C  -0.599011 -3.035966 0.670807
C  0.423761 3.397875 1.785883
C  0.383082 -3.674775 -0.065363
C  1.700504 4.594856 0.672032
H  -1.927286 2.653732 -0.311447
H  -1.24676 0.373121 -2.207444
H  -0.990944 2.114982 -2.444045
H  -3.079669 -0.147346 -0.700195
H  -3.716659 1.326848 -1.399539
H  2.300462 0.905836 0.647859
H  1.170389 0.750078 1.99235
H  -4.139338 2.24919 0.880646
H  -3.506581 0.787983 1.599231
H  -1.395011 -1.158937 1.269593
H  -5.330487 -0.552512 0.499353
H  -5.995178 0.713122 1.524342
H  -5.970919 0.918412 -0.22247
H  2.100517 -3.442916 -1.329205
H  -1.334592 -3.607095 1.219127
H  -0.335275 3.007165 2.444806
H  2.177099 5.4671 0.253053
totalener: -1817.01863524 hartree
nucrepener: 2158.70595618 hartree
electener: -3975.72459142 hartree
oneelecener: -6782.45984497 hartree
twoeener: 2806.73525355 hartree
kineticenergy: 1811.92229122 hartree
xcener: -128.813898665307 hartree
chargesum: -0.0000000
charge: -0.041797 -0.063878 -0.385698 -0.310014 0.113506 -0.292661 -0.336563 0.554347 0.135354 0.022949 -0.196296 -0.118603 -0.127848 -0.073906 -0.014597 -0.152923 -0.259510 -0.156880 -0.164125 0.023086 0.112479 0.055659 0.083199 0.072318 0.100397 0.061639 0.082134 0.133098 0.127127 0.060860 0.064571 0.142694 0.074919 0.088797 0.074745 0.113817 0.124298 0.143268 0.130038
qa: -0.0418 -0.0639 -0.3857 -0.3100 0.1135 -0.2927 -0.3366 0.5543 0.1354 0.0229 -0.1963 -0.1186 -0.1278 -0.0739 -0.0146 -0.1529 -0.2595 -0.1569 -0.1641 0.0231 0.1125 0.0557 0.0832 0.0723 0.1004 0.0616 0.0821 0.1331 0.1271 0.0609 0.0646 0.1427 0.0749 0.0888 0.0747 0.1138 0.1243 0.1433 0.1300
va: 1.2817 1.2415 1.9799 2.0478 3.3607 2.8788 3.0559 3.9114 3.8912 3.9582 3.9466 3.7997 3.5566 3.8595 4.0525 3.9527 3.9484 4.0774 4.0653 4.0814 3.9195 4.0553 1.0013 1.0034 0.9963 1.0117 1.0147 1.0365 1.0040 1.0105 1.0167 1.0161 1.0022 1.0061 1.0033 1.0292 1.0145 1.0094 1.0013
dispcorr: -0.021662743 hartree
energy: -1817.040297983272
dipole: -33.36009 32.07159 -1.28850 19.88163 -20.80715 -0.92552 5.80751 -5.82374 -0.01623
magnitude: 1.58653 au
magnitude: 4.03263 debye
