program: Orca
programVersion: 4.2.1
elementType: Cl Cl O O N N N C C C C C C C C C C C C C C C H H H H H H H H H H H H H H H H H
charge: 0
multiplicity: 1
keywords: wb97x-d3
keywords: def2-TZVPP
keywords: def2/J RIJCOSX GRIDX6 NOFINALGRIDX
keywords: grid4 nofinalgrid
keywords: scfconv7
keywords: smallprint printgap noloewdin
keywords: NOSOSCF
formula: C15H17Cl2N3O2
InChI: InChI=1S/C15H17Cl2N3O2/c1-2-3-12-7-21-15(22-12,8-20-10-18-9-19-20)13-5-4-11(16)6-14(13)17/h4-6,9-10,12H,2-3,7-8H2,1H3
39 atoms
Cl -0.103419 -0.938179 2.323331
Cl 0.396396 -5.293469 -0.702778
O  -0.624663 1.227515 0.407932
O  0.432145 1.291588 -1.565001
N  1.813221 2.6450 0.502164
N  2.432955 3.411417 -0.400108
N  1.394255 4.683351 1.127564
C  0.484367 0.739253 -0.289435
C  -1.517677 1.875183 -0.488449
C  -0.921895 1.550906 -1.855866
C  -2.950648 1.413997 -0.277821
C  1.780044 1.216021 0.379349
C  0.456251 -0.787208 -0.350798
C  -3.160618 -0.09552 -0.2331
C  0.197447 -1.598959 0.751878
C  0.72732 -1.424111 -1.557878
C  -4.634397 -0.45916 -0.11958
C  0.175832 -2.981787 0.650622
C  0.713035 -2.802171 -1.685191
C  1.191863 3.421457 1.40362
C  0.429278 -3.575084 -0.573368
C  2.159141 4.622222 0.015906
H  -1.460579 2.955812 -0.309289
H  -1.404198 0.683386 -2.323327
H  -0.973623 2.389165 -2.550002
H  -3.556929 1.854229 -1.077942
H  -3.329306 1.852066 0.64973
H  2.637614 0.907124 -0.216041
H  1.875494 0.76591 1.367066
H  -2.617156 -0.510693 0.616737
H  -2.742202 -0.573727 -1.123031
H  0.953905 -0.823207 -2.427479
H  -4.771418 -1.538843 -0.064787
H  -5.082296 -0.026235 0.776361
H  -5.203881 -0.097945 -0.977529
H  -0.035159 -3.586099 1.521325
H  0.922036 -3.266207 -2.638653
H  0.620801 3.025362 2.22858
H  2.528884 5.496263 -0.497098
totalener: -1817.01770142 hartree
nucrepener: 2193.63590413 hartree
electener: -4010.65360555 hartree
oneelecener: -6852.29756302 hartree
twoeener: 2841.64395747 hartree
kineticenergy: 1811.92048946 hartree
xcener: -128.816788695687 hartree
chargesum: -0.0000000
charge: -0.064642 -0.063534 -0.368138 -0.334518 0.117101 -0.297678 -0.334614 0.593837 0.170713 -0.049894 -0.167616 -0.136945 -0.115921 -0.080128 -0.078811 -0.126975 -0.267478 -0.122986 -0.158864 0.021733 0.098987 0.052265 0.095057 0.085459 0.101743 0.067193 0.076827 0.123448 0.139483 0.071276 0.050926 0.143108 0.088962 0.077943 0.074099 0.114038 0.127143 0.147135 0.130269
qa: -0.0646 -0.0635 -0.3681 -0.3345 0.1171 -0.2977 -0.3346 0.5938 0.1707 -0.0499 -0.1676 -0.1369 -0.1159 -0.0801 -0.0788 -0.1270 -0.2675 -0.1230 -0.1589 0.0217 0.0990 0.0523 0.0951 0.0855 0.1017 0.0672 0.0768 0.1234 0.1395 0.0713 0.0509 0.1431 0.0890 0.0779 0.0741 0.1140 0.1271 0.1471 0.1303
va: 1.2518 1.2421 2.0035 2.0356 3.3478 2.8821 3.0540 3.8419 3.8658 3.9795 3.9353 3.8079 3.5166 3.8730 4.0368 3.9253 3.9605 4.0602 4.0459 4.0751 3.9408 4.0565 0.9957 0.9933 1.0017 1.0099 1.0109 1.0284 1.0130 1.0187 1.0142 1.0254 1.0048 1.0023 1.0028 1.0269 1.0133 1.0103 1.0012
dispcorr: -0.023109025 hartree
energy: -1817.040810448737
dipole: -20.89866 20.06214 -0.83652 17.66004 -18.53340 -0.87336 -8.72741 8.16906 -0.55835
magnitude: 1.33202 au
magnitude: 3.38573 debye
