program: Orca
programVersion: 4.2.1
elementType: Cl Cl O O N N N C C C C C C C C C C C C C C C H H H H H H H H H H H H H H H H H
charge: 0
multiplicity: 1
keywords: wb97x-d3
keywords: def2-TZVPP
keywords: def2/J RIJCOSX GRIDX6 NOFINALGRIDX
keywords: grid4 nofinalgrid
keywords: scfconv7
keywords: smallprint printgap noloewdin
keywords: NOSOSCF
formula: C15H17Cl2N3O2
InChI: InChI=1S/C15H17Cl2N3O2/c1-2-3-12-7-21-15(22-12,8-20-10-18-9-19-20)13-5-4-11(16)6-14(13)17/h4-6,9-10,12H,2-3,7-8H2,1H3
39 atoms
Cl 0.107358 -1.14245 2.393212
Cl 0.965709 -5.34365 -0.763962
O  -0.663367 1.033114 0.594376
O  0.200373 1.218885 -1.446459
N  1.648475 2.66873 0.491306
N  2.2003 3.45825 -0.43451
N  1.133989 4.687039 1.109346
C  0.419532 0.653294 -0.195675
C  -1.78474 1.290422 -0.239019
C  -1.193423 1.220391 -1.655876
C  -2.899121 0.287855 0.00883
C  1.708251 1.239361 0.388024
C  0.542124 -0.868113 -0.295515
C  -4.154666 0.555832 -0.81918
C  0.411361 -1.727459 0.794188
C  0.838773 -1.444103 -1.527486
C  -4.862109 1.861806 -0.479311
C  0.538335 -3.101978 0.655369
C  0.971108 -2.811512 -1.69135
C  1.008754 3.418979 1.402119
C  0.812323 -3.635854 -0.5911
C  1.870856 4.656456 -0.022348
H  -2.127799 2.30384 -0.009491
H  -1.517677 0.309714 -2.177004
H  -1.448105 2.079491 -2.275998
H  -3.154926 0.297649 1.071753
H  -2.524489 -0.716826 -0.210118
H  2.551098 0.984613 -0.252249
H  1.890809 0.807894 1.372342
H  -4.846925 -0.274319 -0.663606
H  -3.913868 0.535549 -1.88702
H  0.968736 -0.801214 -2.387241
H  -4.258309 2.738335 -0.716888
H  -5.794259 1.956319 -1.035803
H  -5.107394 1.911992 0.582657
H  0.42658 -3.745839 1.516059
H  1.196835 -3.228106 -2.662663
H  0.482976 2.999841 2.245248
H  2.176392 5.544278 -0.55345
totalener: -1817.01668260 hartree
nucrepener: 2168.77945338 hartree
electener: -3985.79613598 hartree
oneelecener: -6802.54626451 hartree
twoeener: 2816.75012853 hartree
kineticenergy: 1811.92390518 hartree
xcener: -128.816450208735 hartree
chargesum: 0.0000000
charge: -0.057305 -0.063088 -0.363283 -0.333128 0.112197 -0.299060 -0.338061 0.585859 0.189767 -0.048315 -0.181240 -0.124905 -0.175065 -0.113886 -0.031680 -0.130237 -0.254195 -0.144648 -0.168253 0.034834 0.109655 0.053909 0.097797 0.081222 0.104206 0.079057 0.074276 0.122812 0.140069 0.076223 0.055847 0.146360 0.074256 0.090850 0.082284 0.113733 0.127564 0.143777 0.129796
qa: -0.0573 -0.0631 -0.3633 -0.3331 0.1122 -0.2991 -0.3381 0.5859 0.1898 -0.0483 -0.1812 -0.1249 -0.1751 -0.1139 -0.0317 -0.1302 -0.2542 -0.1446 -0.1683 0.0348 0.1097 0.0539 0.0978 0.0812 0.1042 0.0791 0.0743 0.1228 0.1401 0.0762 0.0558 0.1464 0.0743 0.0909 0.0823 0.1137 0.1276 0.1438 0.1298
va: 1.2610 1.2426 2.0114 2.0390 3.3528 2.8814 3.0592 3.8565 3.8194 3.9577 3.9815 3.7978 3.5907 3.8993 4.0293 3.9353 3.9326 4.0770 4.0570 4.0796 3.9287 4.0603 0.9984 0.9949 0.9967 1.0179 1.0085 1.0271 1.0111 1.0069 1.0104 1.0235 1.0028 1.0062 1.0031 1.0285 1.0136 1.0116 1.0012
dispcorr: -0.022023109 hartree
energy: -1817.038705710506
dipole: -25.10365 24.14676 -0.95689 22.02311 -23.08881 -1.06570 -9.78151 9.26487 -0.51664
magnitude: 1.52259 au
magnitude: 3.87012 debye
