program: Orca
programVersion: 4.2.1
elementType: Cl Cl O O N N N C C C C C C C C C C C C C C C H H H H H H H H H H H H H H H H H
charge: 0
multiplicity: 1
keywords: wb97x-d3
keywords: def2-TZVPP
keywords: def2/J RIJCOSX GRIDX6 NOFINALGRIDX
keywords: grid4 nofinalgrid
keywords: scfconv7
keywords: smallprint printgap noloewdin
keywords: NOSOSCF
formula: C15H17Cl2N3O2
InChI: InChI=1S/C15H17Cl2N3O2/c1-2-3-12-7-21-15(22-12,8-20-10-18-9-19-20)13-5-4-11(16)6-14(13)17/h4-6,9-10,12H,2-3,7-8H2,1H3
39 atoms
Cl -0.356973 -1.245807 2.062239
Cl 0.981746 -5.357154 -1.046006
O  -0.814331 0.970141 0.186858
O  0.499041 1.245147 -1.6082
N  1.429639 2.583329 0.721949
N  2.056896 3.474337 -0.051574
N  0.724502 4.516182 1.42194
C  0.42405 0.625536 -0.364609
C  -1.600628 1.665619 -0.773244
C  -0.821401 1.429403 -2.061257
C  -3.024461 1.14724 -0.821402
C  1.563304 1.171102 0.506489
C  0.546309 -0.891447 -0.497661
C  -3.910329 1.533723 0.359914
C  0.214288 -1.784089 0.520075
C  1.043618 -1.432006 -1.679437
C  -3.523899 0.912749 1.695606
C  0.345394 -3.15514 0.357431
C  1.18263 -2.796126 -1.866608
C  0.632248 3.222997 1.591882
C  0.824407 -3.653072 -0.841185
C  1.608953 4.616576 0.40551
H  -1.601221 2.734543 -0.520349
H  -1.191844 0.542157 -2.593299
H  -0.842444 2.279228 -2.74267
H  -3.001059 0.059116 -0.939757
H  -3.479608 1.54511 -1.735168
H  2.520809 0.989428 0.020898
H  1.57006 0.660609 1.469059
H  -4.934974 1.240725 0.117538
H  -3.928864 2.623933 0.452069
H  1.329549 -0.765171 -2.480763
H  -2.566123 1.278756 2.060498
H  -4.274332 1.141523 2.452676
H  -3.447218 -0.172617 1.621726
H  0.075872 -3.824482 1.16186
H  1.566395 -3.184636 -2.799199
H  0.021589 2.710447 2.318641
H  1.935565 5.559606 -0.004007
totalener: -1817.01747980 hartree
nucrepener: 2191.66744709 hartree
electener: -4008.68492689 hartree
oneelecener: -6848.42777484 hartree
twoeener: 2839.74284795 hartree
kineticenergy: 1811.91868305 hartree
xcener: -128.813974529583 hartree
chargesum: -0.0000000
charge: -0.066070 -0.063904 -0.348784 -0.334093 0.122224 -0.298977 -0.332972 0.556703 0.145018 -0.024844 -0.166868 -0.136321 -0.094054 -0.093634 -0.053006 -0.122180 -0.239885 -0.147210 -0.163160 0.019004 0.104734 0.052927 0.080296 0.082760 0.101437 0.067636 0.079645 0.123074 0.140234 0.068475 0.053264 0.144676 0.067937 0.090092 0.070974 0.115413 0.126005 0.143024 0.130409
qa: -0.0661 -0.0639 -0.3488 -0.3341 0.1222 -0.2990 -0.3330 0.5567 0.1450 -0.0248 -0.1669 -0.1363 -0.0941 -0.0936 -0.0530 -0.1222 -0.2399 -0.1472 -0.1632 0.0190 0.1047 0.0529 0.0803 0.0828 0.1014 0.0676 0.0796 0.1231 0.1402 0.0685 0.0533 0.1447 0.0679 0.0901 0.0710 0.1154 0.1260 0.1430 0.1304
va: 1.2527 1.2417 2.0133 2.0391 3.3476 2.8824 3.0547 3.8624 3.8431 3.9744 3.9455 3.8103 3.5960 3.9056 4.0550 3.9201 3.9393 4.0771 4.0521 4.0861 3.9337 4.0526 0.9996 0.9959 0.9999 1.0145 1.0111 1.0287 1.0130 1.0061 1.0102 1.0243 1.0104 1.0086 1.0103 1.0262 1.0142 1.0080 1.0013
dispcorr: -0.022998826 hartree
energy: -1817.040478622454
dipole: -19.88161 19.23789 -0.64372 23.55929 -24.36044 -0.80115 -3.33389 2.61164 -0.72225
magnitude: 1.25613 au
magnitude: 3.19283 debye
