program: Orca
programVersion: 4.2.1
elementType: Cl Cl O O N N N C C C C C C C C C C C C C C C H H H H H H H H H H H H H H H H H
charge: 0
multiplicity: 1
keywords: wb97x-d3
keywords: def2-TZVPP
keywords: def2/J RIJCOSX GRIDX6 NOFINALGRIDX
keywords: grid4 nofinalgrid
keywords: scfconv7
keywords: smallprint printgap noloewdin
keywords: NOSOSCF
formula: C15H17Cl2N3O2
InChI: InChI=1S/C15H17Cl2N3O2/c1-2-3-12-7-21-15(22-12,8-20-10-18-9-19-20)13-5-4-11(16)6-14(13)17/h4-6,9-10,12H,2-3,7-8H2,1H3
39 atoms
Cl -0.176266 -1.10012 2.258597
Cl 0.606796 -5.278166 -0.950395
O  -0.779397 1.151827 0.412456
O  0.354837 1.316592 -1.518332
N  1.644179 2.65236 0.582716
N  1.113725 3.315795 1.614066
N  1.841552 4.751142 0.051286
C  0.365825 0.724536 -0.246024
C  -1.718153 1.610696 -0.544198
C  -0.803555 2.119434 -1.653309
C  -2.681232 0.523577 -1.002244
C  1.60948 1.218983 0.511438
C  0.419444 -0.795164 -0.394466
C  -3.442775 -0.166917 0.124942
C  0.189261 -1.669054 0.666864
C  0.732185 -1.361399 -1.626938
C  -4.312735 0.77148 0.950198
C  0.242297 -3.045588 0.501669
C  0.795386 -2.730773 -1.815244
C  2.068355 3.525816 -0.344374
C  0.543462 -3.56818 -0.742854
C  1.256621 4.566991 1.255343
H  -2.268866 2.430257 -0.077324
H  -1.221566 1.97869 -2.652189
H  -0.552853 3.177177 -1.524458
H  -2.143463 -0.226799 -1.590213
H  -3.395897 0.991475 -1.688763
H  2.501504 0.865224 -0.00767
H  1.63097 0.828071 1.526032
H  -2.740859 -0.685037 0.780208
H  -4.069888 -0.943461 -0.318915
H  0.922692 -0.713032 -2.469756
H  -3.719134 1.489428 1.517075
H  -5.004309 1.33435 0.319759
H  -4.910158 0.214314 1.671665
H  0.050087 -3.699068 1.340582
H  1.035678 -3.138802 -2.786733
H  2.532112 3.224284 -1.270598
H  0.933601 5.379385 1.887213
totalener: -1817.01649769 hartree
nucrepener: 2201.39159262 hartree
electener: -4018.40809031 hartree
oneelecener: -6867.98098297 hartree
twoeener: 2849.57289266 hartree
kineticenergy: 1811.91548311 hartree
xcener: -128.816273682431 hartree
chargesum: 0.0000000
charge: -0.053751 -0.064573 -0.329783 -0.382605 0.121011 -0.298034 -0.332526 0.547270 0.183750 -0.030717 -0.211908 -0.131834 -0.074630 -0.097699 -0.055741 -0.161401 -0.272107 -0.134715 -0.143195 0.013000 0.099606 0.053789 0.102660 0.090559 0.096738 0.087158 0.079440 0.123557 0.134773 0.067282 0.069561 0.136248 0.087996 0.076380 0.088464 0.113058 0.125996 0.145865 0.131055
qa: -0.0538 -0.0646 -0.3298 -0.3826 0.1210 -0.2980 -0.3325 0.5473 0.1838 -0.0307 -0.2119 -0.1318 -0.0746 -0.0977 -0.0557 -0.1614 -0.2721 -0.1347 -0.1432 0.0130 0.0996 0.0538 0.1027 0.0906 0.0967 0.0872 0.0794 0.1236 0.1348 0.0673 0.0696 0.1362 0.0880 0.0764 0.0885 0.1131 0.1260 0.1459 0.1311
va: 1.2642 1.2412 2.0346 1.9864 3.3573 2.8769 3.0517 3.8879 3.8048 4.0150 3.9461 3.8198 3.5243 3.8834 4.0375 3.9559 3.9381 4.0690 4.0350 4.0710 3.9339 4.0446 0.9910 0.9981 0.9944 1.0029 1.0118 1.0056 1.0349 1.0273 1.0105 1.0325 1.0003 1.0009 1.0071 1.0286 1.0128 1.0090 1.0015
dispcorr: -0.023427418 hartree
energy: -1817.039925106231
dipole: -19.53881 19.08666 -0.45215 20.51320 -21.20244 -0.68924 -6.86808 5.88447 -0.98361
magnitude: 1.28335 au
magnitude: 3.26201 debye
