program: Orca
programVersion: 4.2.1
elementType: Cl Cl O O N N N C C C C C C C C C C C C C C C H H H H H H H H H H H H H H H H H
charge: 0
multiplicity: 1
keywords: wb97x-d3
keywords: def2-TZVPP
keywords: def2/J RIJCOSX GRIDX6 NOFINALGRIDX
keywords: grid4 nofinalgrid
keywords: scfconv7
keywords: smallprint printgap noloewdin
keywords: NOSOSCF
formula: C15H17Cl2N3O2
InChI: InChI=1S/C15H17Cl2N3O2/c1-2-3-12-7-21-15(22-12,8-20-10-18-9-19-20)13-5-4-11(16)6-14(13)17/h4-6,9-10,12H,2-3,7-8H2,1H3
39 atoms
Cl 0.334155 -1.089354 2.279578
Cl 0.57656 -5.216481 -1.077968
O  -0.513681 1.192668 0.634161
O  0.156934 1.399653 -1.47278
N  1.858999 2.686815 0.414761
N  1.739054 3.203123 1.641113
N  1.850929 4.838332 0.110495
C  0.460117 0.776382 -0.259224
C  -1.710272 1.458548 -0.07576
C  -1.24979 1.497855 -1.545219
C  -2.781911 0.417697 0.201269
C  1.83556 1.268829 0.198519
C  0.482948 -0.744312 -0.428031
C  -4.116802 0.770433 -0.444565
C  0.423864 -1.634529 0.643869
C  0.601538 -1.290338 -1.702721
C  -5.191069 -0.268958 -0.159812
C  0.451352 -3.007825 0.448716
C  0.63092 -2.656363 -1.922428
C  1.91815 3.678296 -0.488244
C  0.549534 -3.510187 -0.836546
C  1.740431 4.491817 1.4115
H  -2.06607 2.441364 0.25046
H  -1.671995 0.662488 -2.118158
H  -1.506189 2.42705 -2.053969
H  -2.911942 0.326566 1.282801
H  -2.444622 -0.562077 -0.153796
H  2.5744 0.997366 -0.55734
H  2.117914 0.786575 1.131811
H  -3.997665 0.874495 -1.528109
H  -4.449203 1.748741 -0.084044
H  0.669289 -0.626406 -2.553402
H  -5.364079 -0.373676 0.912088
H  -6.140186 0.000767 -0.622398
H  -4.903736 -1.249375 -0.542312
H  0.398628 -3.675391 1.296906
H  0.716812 -3.049051 -2.925631
H  2.014761 3.506483 -1.548432
H  1.665822 5.211502 2.211501
totalener: -1817.01708761 hartree
nucrepener: 2168.96377666 hartree
electener: -3985.98086426 hartree
oneelecener: -6803.01399777 hartree
twoeener: 2817.03313351 hartree
kineticenergy: 1811.92428286 hartree
xcener: -128.815273869626 hartree
chargesum: -0.0000000
charge: -0.041184 -0.063336 -0.328044 -0.366811 0.109338 -0.292332 -0.337003 0.583019 0.235541 -0.071133 -0.197659 -0.120577 -0.195054 -0.098792 -0.021943 -0.125778 -0.254667 -0.143938 -0.174212 0.037621 0.110657 0.053660 0.092341 0.086566 0.105713 0.078814 0.060788 0.128107 0.134486 0.057179 0.065781 0.142037 0.079011 0.087885 0.075591 0.113482 0.126014 0.139477 0.129355
qa: -0.0412 -0.0633 -0.3280 -0.3668 0.1093 -0.2923 -0.3370 0.5830 0.2355 -0.0711 -0.1977 -0.1206 -0.1951 -0.0988 -0.0219 -0.1258 -0.2547 -0.1439 -0.1742 0.0376 0.1107 0.0537 0.0923 0.0866 0.1057 0.0788 0.0608 0.1281 0.1345 0.0572 0.0658 0.1420 0.0790 0.0879 0.0756 0.1135 0.1260 0.1395 0.1294
va: 1.2798 1.2421 2.0529 1.9914 3.3597 2.8804 3.0616 3.8486 3.8303 3.9546 3.9782 3.7972 3.5794 3.8792 4.0478 3.9305 3.9503 4.0729 4.0685 4.0868 3.9258 4.0597 0.9987 0.9943 0.9976 1.0220 1.0024 1.0047 1.0321 1.0100 1.0093 1.0241 1.0036 1.0051 1.0039 1.0297 1.0143 1.0118 1.0015
dispcorr: -0.021805575 hartree
energy: -1817.038893180530
dipole: -25.16010 24.31625 -0.84385 17.70884 -18.62976 -0.92092 -8.44608 7.36100 -1.08509
magnitude: 1.65456 au
magnitude: 4.20557 debye
