program: Orca
programVersion: 4.2.1
elementType: Cl Cl O O N N N C C C C C C C C C C C C C C C H H H H H H H H H H H H H H H H H
charge: 0
multiplicity: 1
keywords: wb97x-d3
keywords: def2-TZVPP
keywords: def2/J RIJCOSX GRIDX6 NOFINALGRIDX
keywords: grid4 nofinalgrid
keywords: scfconv7
keywords: smallprint printgap noloewdin
keywords: NOSOSCF
formula: C15H17Cl2N3O2
InChI: InChI=1S/C15H17Cl2N3O2/c1-2-3-12-7-21-15(22-12,8-20-10-18-9-19-20)13-5-4-11(16)6-14(13)17/h4-6,9-10,12H,2-3,7-8H2,1H3
39 atoms
Cl -0.646257 -0.611636 2.565256
Cl 1.833227 -4.165576 -0.528842
O  -1.750049 1.407958 0.744858
O  -0.705718 1.947662 -1.139927
N  1.780535 2.235203 0.363323
N  2.721732 1.434629 0.87273
N  3.494162 2.490469 -0.947954
C  -0.507503 1.371012 0.118032
C  -2.766451 1.35615 -0.244139
C  -1.988691 1.534999 -1.559449
C  -3.566714 0.068519 -0.17298
C  0.453045 2.260954 0.911862
C  0.040311 -0.048226 -0.02079
C  -4.739758 0.066499 -1.146771
C  0.023601 -0.979385 1.015097
C  0.658015 -0.428846 -1.208106
C  -5.56987 -1.205517 -1.05682
C  0.566964 -2.245963 0.862997
C  1.212077 -1.684146 -1.383287
C  2.256933 2.852738 -0.728743
C  1.155594 -2.590735 -0.340036
C  3.730203 1.621701 0.058705
H  -3.435309 2.206603 -0.068675
H  -1.938341 0.593707 -2.12209
H  -2.404588 2.302803 -2.21138
H  -3.938078 -0.061546 0.846882
H  -2.90907 -0.783359 -0.37496
H  0.512798 1.921109 1.943429
H  0.069587 3.282524 0.906686
H  -4.378293 0.186616 -2.173289
H  -5.377787 0.933657 -0.949586
H  0.718478 0.280119 -2.022035
H  -4.968948 -2.087189 -1.283412
H  -5.981091 -1.337745 -0.055154
H  -6.405006 -1.186204 -1.756578
H  0.53795 -2.949805 1.682299
H  1.687592 -1.948144 -2.317054
H  1.675218 3.545663 -1.316218
H  4.6731 1.116748 0.197183
totalener: -1817.01788028 hartree
nucrepener: 2202.12693171 hartree
electener: -4019.14481199 hartree
oneelecener: -6869.59104112 hartree
twoeener: 2850.44622913 hartree
kineticenergy: 1811.92120247 hartree
xcener: -128.815079300818 hartree
chargesum: 0.0000000
charge: -0.058772 -0.068277 -0.338759 -0.356098 0.105359 -0.302535 -0.328227 0.589306 0.207338 -0.077621 -0.190607 -0.097105 -0.181008 -0.094774 0.002364 -0.131650 -0.255793 -0.134328 -0.175105 0.036353 0.113816 0.060574 0.084162 0.086657 0.106128 0.077442 0.064117 0.131103 0.111617 0.057761 0.062479 0.139743 0.077750 0.077819 0.087617 0.110035 0.125560 0.144214 0.131343
qa: -0.0588 -0.0683 -0.3388 -0.3561 0.1054 -0.3025 -0.3282 0.5893 0.2073 -0.0776 -0.1906 -0.0971 -0.1810 -0.0948 0.0024 -0.1317 -0.2558 -0.1343 -0.1751 0.0364 0.1138 0.0606 0.0842 0.0867 0.1061 0.0774 0.0641 0.1311 0.1116 0.0578 0.0625 0.1397 0.0778 0.0778 0.0876 0.1100 0.1256 0.1442 0.1313
va: 1.2623 1.2370 2.0515 2.0055 3.3276 2.8537 3.0635 3.8336 3.8675 3.9862 3.9689 3.8432 3.5647 3.8801 4.0099 3.8829 3.9542 4.0925 4.1021 4.0797 3.9245 4.0442 1.0015 0.9918 0.9946 1.0208 1.0067 1.0287 1.0235 1.0093 1.0091 1.0205 1.0037 1.0037 1.0047 1.0284 1.0131 1.0116 1.0019
dispcorr: -0.022909772 hartree
energy: -1817.040790050749
dipole: -30.46907 28.68702 -1.78206 12.13573 -11.82700 0.30873 -13.12539 12.55939 -0.56600
magnitude: 1.89510 au
magnitude: 4.81696 debye
