program: Orca
programVersion: 4.2.1
elementType: Cl Cl N N N C C C C C C C C C C C C C H H H H H H H H H H H H H H H
charge: 0
multiplicity: 1
keywords: wb97x-d3
keywords: def2-TZVPP
keywords: def2/J RIJCOSX GRIDX6 NOFINALGRIDX
keywords: grid4 nofinalgrid
keywords: scfconv7
keywords: smallprint printgap noloewdin
keywords: NOSOSCF
formula: C13H15Cl2N3
InChI: InChI=1S/C13H15Cl2N3/c1-2-3-10(7-18-9-16-8-17-18)12-5-4-11(14)6-13(12)15/h4-6,8-10H,2-3,7H2,1H3
33 atoms
Cl -0.117628 -0.6494 2.224507
Cl 4.110383 1.636564 -0.098732
N  -1.173282 -2.173479 -0.815474
N  -1.678665 -2.998047 0.105314
N  0.453992 -3.534964 -0.338942
C  -1.745057 0.177703 -0.313093
C  -2.644529 1.32777 -0.768828
C  -1.898431 -1.010815 -1.269842
C  -0.288644 0.562064 -0.20999
C  -2.619477 2.527885 0.167789
C  0.522367 0.22472 0.870787
C  0.329349 1.231226 -1.266281
C  -3.581273 3.61981 -0.27441
C  1.870831 0.551881 0.921199
C  1.670964 1.566845 -1.253418
C  0.097618 -2.496025 -1.054607
C  2.431956 1.224622 -0.147557
C  -0.670493 -3.791999 0.353212
H  -2.103482 -0.143637 0.666843
H  -2.382886 1.644515 -1.783225
H  -3.667288 0.944831 -0.832034
H  -1.535785 -0.756278 -2.265786
H  -2.9480 -1.284108 -1.36487
H  -2.873217 2.200914 1.180383
H  -1.607428 2.937012 0.224008
H  -0.253684 1.501816 -2.137547
H  -4.60942 3.25501 -0.304573
H  -3.332733 3.984822 -1.272642
H  -3.554779 4.473485 0.403176
H  2.468576 0.280616 1.78014
H  2.111567 2.086738 -2.09256
H  0.711637 -1.969518 -1.768349
H  -0.753112 -4.601689 1.061031
elementType: Cl N C H
totalener: -1589.15832749 hartree
nucrepener: 1583.06598464 hartree
electener: -3172.22431213 hartree
oneelecener: -5323.03489729 hartree
twoeener: 2150.81058516 hartree
cpcmener: -0.02510206 hartree
kineticenergy: 1584.92827037 hartree
xcener: -108.651718731767 hartree
chargesum: -0.0000000
charge: -0.085938 -0.089113 0.119040 -0.349299 -0.407082 0.125523 -0.193153 -0.101735 -0.082220 -0.064044 0.057520 -0.168851 -0.287013 -0.126442 -0.164000 0.042039 0.099482 0.054665 0.072895 0.078658 0.088248 0.129377 0.119040 0.063414 0.065136 0.144557 0.080660 0.081332 0.092398 0.123445 0.147880 0.174378 0.159202
qa: -0.0859 -0.0891 0.1190 -0.3493 -0.4071 0.1255 -0.1932 -0.1017 -0.0822 -0.0640 0.0575 -0.1689 -0.2870 -0.1264 -0.1640 0.0420 0.0995 0.0547 0.0729 0.0787 0.0882 0.1294 0.1190 0.0634 0.0651 0.1446 0.0807 0.0813 0.0924 0.1234 0.1479 0.1744 0.1592
va: 1.2382 1.2145 3.3547 2.8758 3.0127 3.7088 3.9344 3.8874 3.4779 3.8401 3.8884 3.9387 3.9530 4.0688 4.0474 4.0769 3.8521 4.0603 1.0514 1.0068 1.0104 0.9965 1.0156 1.0086 1.0085 1.0037 1.0005 0.9996 1.0032 1.0213 1.0034 0.9934 0.9967
dispcorr: -0.018092456 hartree
energy: -1589.176419951042
dipole: -28.40175 27.25908 -1.14266 12.42754 -10.70678 1.72076 -10.88365 9.30486 -1.57879
magnitude: 2.59986 au
magnitude: 6.60833 debye
