program: Orca
programVersion: 4.2.1
elementType: Cl Cl N N N C C C C C C C C C C C C C H H H H H H H H H H H H H H H
charge: 0
multiplicity: 1
keywords: wb97x-d3
keywords: def2-TZVPP
keywords: def2/J RIJCOSX GRIDX6 NOFINALGRIDX
keywords: grid4 nofinalgrid
keywords: scfconv7
keywords: smallprint printgap noloewdin
keywords: NOSOSCF
formula: C13H15Cl2N3
InChI: InChI=1S/C13H15Cl2N3/c1-2-3-10(7-18-9-16-8-17-18)12-5-4-11(14)6-13(12)15/h4-6,8-10H,2-3,7H2,1H3
33 atoms
Cl 0.424656 0.262721 2.620867
Cl 4.026984 3.188225 -0.020976
N  -1.324969 -2.815203 -0.883641
N  -2.314089 -2.962718 -1.768243
N  -2.496657 -4.484367 -0.128672
C  -0.747187 -0.503386 -0.180164
C  -1.970206 0.210834 -0.762716
C  -0.344899 -1.75565 -0.972145
C  0.443609 0.420867 -0.09983
C  -2.426948 1.3924 0.083926
C  1.039311 0.814606 1.095838
C  1.001086 0.929847 -1.272651
C  -3.658202 2.075161 -0.490471
C  2.136727 1.663866 1.134828
C  2.095839 1.775323 -1.270763
C  -1.452328 -3.720925 0.085265
C  2.656955 2.134407 -0.056483
C  -2.982825 -3.973078 -1.274012
H  -1.005747 -0.834573 0.828276
H  -1.753474 0.544281 -1.78342
H  -2.793726 -0.502336 -0.845733
H  0.595022 -2.152278 -0.589063
H  -0.195595 -1.534148 -2.027872
H  -2.639153 1.046108 1.0997
H  -1.618256 2.122894 0.173955
H  0.565022 0.663019 -2.227197
H  -3.461827 2.474136 -1.487412
H  -3.980164 2.906698 0.13759
H  -4.49764 1.382248 -0.573243
H  2.573357 1.951341 2.080967
H  2.499985 2.146494 -2.201936
H  -0.762241 -3.79677 0.911206
H  -3.860198 -4.36233 -1.766154
elementType: Cl N C H
totalener: -1589.15637977 hartree
nucrepener: 1518.26095696 hartree
electener: -3107.41733673 hartree
oneelecener: -5192.85388389 hartree
twoeener: 2085.43654716 hartree
cpcmener: -0.02276590 hartree
kineticenergy: 1584.90701446 hartree
xcener: -108.645483831723 hartree
chargesum: 0.0000000
charge: -0.086192 -0.089769 0.092557 -0.359040 -0.425627 0.121915 -0.150933 -0.102963 -0.059330 -0.075343 0.029419 -0.157820 -0.287561 -0.135613 -0.183096 0.074609 0.104165 0.067984 0.071815 0.074265 0.081918 0.137381 0.125200 0.060264 0.064802 0.142649 0.081657 0.091744 0.081120 0.122524 0.147334 0.176107 0.163856
qa: -0.0862 -0.0898 0.0926 -0.3590 -0.4256 0.1219 -0.1509 -0.1030 -0.0593 -0.0753 0.0294 -0.1578 -0.2876 -0.1356 -0.1831 0.0746 0.1042 0.0680 0.0718 0.0743 0.0819 0.1374 0.1252 0.0603 0.0648 0.1426 0.0817 0.0917 0.0811 0.1225 0.1473 0.1761 0.1639
va: 1.2369 1.2134 3.3876 2.8749 3.0261 3.6900 3.8607 3.8533 3.4930 3.8552 3.9390 3.9616 3.9553 4.0644 4.0570 4.0491 3.8368 4.0353 1.0490 1.0103 1.0258 1.0032 1.0123 1.0089 1.0074 1.0043 0.9995 1.0031 1.0004 1.0216 1.0047 0.9920 0.9940
dispcorr: -0.016289196 hartree
energy: -1589.172668966729
dipole: -25.11954 25.91134 0.79180 -2.69086 3.43579 0.74492 -11.14732 10.73247 -0.41484
magnitude: 1.16360 au
magnitude: 2.95763 debye
