program: Orca
programVersion: 4.2.1
elementType: Cl Cl N N N C C C C C C C C C C C C C H H H H H H H H H H H H H H H
charge: 0
multiplicity: 1
keywords: wb97x-d3
keywords: def2-TZVPP
keywords: def2/J RIJCOSX GRIDX6 NOFINALGRIDX
keywords: grid4 nofinalgrid
keywords: scfconv7
keywords: smallprint printgap noloewdin
keywords: NOSOSCF
formula: C13H15Cl2N3
InChI: InChI=1S/C13H15Cl2N3/c1-2-3-10(7-18-9-16-8-17-18)12-5-4-11(14)6-13(12)15/h4-6,8-10H,2-3,7H2,1H3
33 atoms
Cl 0.324368 0.828263 2.940522
Cl 4.463335 0.90408 -0.441626
N  -1.421558 -1.885828 -0.213001
N  -0.196344 -2.418471 -0.227371
N  -1.324108 -3.0063 -2.076268
C  -1.493405 0.509745 0.46861
C  -2.332779 1.075706 -0.680628
C  -1.838269 -0.951054 0.806822
C  -0.007565 0.650223 0.245973
C  -3.798021 1.279622 -0.313292
C  0.893919 0.777179 1.30055
C  0.538211 0.605489 -1.034695
C  -4.602728 1.862067 -1.464626
C  2.264161 0.861338 1.108542
C  1.90069 0.682939 -1.265275
C  -2.072906 -2.239048 -1.32131
C  2.754549 0.809284 -0.183772
C  -0.190042 -3.076993 -1.356508
H  -1.76163 1.076724 1.36441
H  -1.910188 2.041071 -0.972357
H  -2.265524 0.441915 -1.570506
H  -2.912098 -1.065084 0.947692
H  -1.364853 -1.250384 1.739309
H  -4.254303 0.335457 -0.00341
H  -3.85953 1.946277 0.551657
H  -0.115137 0.500909 -1.890268
H  -4.19313 2.819369 -1.79137
H  -5.640686 2.029355 -1.175645
H  -4.605258 1.192626 -2.326561
H  2.931857 0.965022 1.952009
H  2.283962 0.642259 -2.274842
H  -3.090108 -1.942149 -1.52291
H  0.672684 -3.642123 -1.6721
elementType: Cl N C H
totalener: -1589.15497253 hartree
nucrepener: 1565.19067292 hartree
electener: -3154.34564546 hartree
oneelecener: -5287.29804473 hartree
twoeener: 2132.95239928 hartree
cpcmener: -0.02348901 hartree
kineticenergy: 1584.91842011 hartree
xcener: -108.650548643981 hartree
chargesum: 0.0000000
charge: -0.090496 -0.092602 0.114206 -0.343417 -0.413729 0.196593 -0.239979 -0.153505 0.031871 -0.074647 -0.024821 -0.180262 -0.292393 -0.141913 -0.184671 0.050686 0.104297 0.062624 0.075201 0.106704 0.075302 0.144858 0.127593 0.060059 0.068585 0.144403 0.082168 0.093440 0.081625 0.123606 0.146924 0.179881 0.161811
qa: -0.0905 -0.0926 0.1142 -0.3434 -0.4137 0.1966 -0.2400 -0.1535 0.0319 -0.0746 -0.0248 -0.1803 -0.2924 -0.1419 -0.1847 0.0507 0.1043 0.0626 0.0752 0.1067 0.0753 0.1449 0.1276 0.0601 0.0686 0.1444 0.0822 0.0934 0.0816 0.1236 0.1469 0.1799 0.1618
va: 1.2382 1.2106 3.3535 2.8740 3.0337 3.6438 3.9529 3.8934 3.4681 3.8538 4.0071 3.9082 3.9544 4.0837 4.0756 4.0604 3.8488 4.0392 1.0317 1.0104 1.0021 0.9941 1.0215 1.0133 1.0060 1.0008 1.0006 1.0037 1.0000 1.0211 1.0045 0.9913 0.9960
dispcorr: -0.017670666 hartree
energy: -1589.172643200308
dipole: -34.75892 32.91011 -1.84881 3.37547 -2.32051 1.05495 -11.49088 11.74283 0.25194
magnitude: 2.14348 au
magnitude: 5.44828 debye
