program: Orca
programVersion: 4.2.1
elementType: Cl Cl N N N C C C C C C C C C C C C C H H H H H H H H H H H H H H H
charge: 0
multiplicity: 1
keywords: wb97x-d3
keywords: def2-TZVPP
keywords: def2/J RIJCOSX GRIDX6 NOFINALGRIDX
keywords: grid4 nofinalgrid
keywords: scfconv7
keywords: smallprint printgap noloewdin
keywords: NOSOSCF
formula: C13H15Cl2N3
InChI: InChI=1S/C13H15Cl2N3/c1-2-3-10(7-18-9-16-8-17-18)12-5-4-11(14)6-13(12)15/h4-6,8-10H,2-3,7H2,1H3
33 atoms
Cl -0.425623 1.022004 2.792824
Cl 4.140316 1.331189 0.033626
N  -1.225886 -2.295036 -0.397238
N  -1.713519 -2.617648 -1.596731
N  0.300071 -3.548377 -1.298502
C  -1.766559 0.084437 0.161893
C  -2.538456 0.496251 -1.093578
C  -1.925182 -1.407147 0.500979
C  -0.302641 0.447868 0.134555
C  -2.477787 1.989463 -1.405756
C  0.394166 0.853521 1.271749
C  0.443185 0.319892 -1.036422
C  -2.930862 2.887807 -0.263996
C  1.753178 1.130785 1.25735
C  1.800871 0.583702 -1.087001
C  -0.023393 -2.851893 -0.235498
C  2.445768 0.990941 0.068178
C  -0.767729 -3.370625 -2.099754
H  -2.23609 0.59519 1.004949
H  -2.206337 -0.070018 -1.96591
H  -3.58255 0.207018 -0.938459
H  -2.980372 -1.679508 0.499173
H  -1.543958 -1.600006 1.503552
H  -1.465547 2.271383 -1.708488
H  -3.10887 2.174397 -2.278692
H  -0.046593 0.004663 -1.948782
H  -3.934048 2.625481 0.080027
H  -2.956184 3.932378 -0.577744
H  -2.263326 2.833727 0.598231
H  2.258329 1.447667 2.159362
H  2.342929 0.470749 -2.015709
H  0.566495 -2.728512 0.659807
H  -0.852831 -3.811752 -3.081041
elementType: Cl N C H
totalener: -1589.16561384 hartree
nucrepener: 1582.97322999 hartree
electener: -3172.13884383 hartree
oneelecener: -5322.59007659 hartree
twoeener: 2150.45123277 hartree
cpcmener: -0.01863172 hartree
kineticenergy: 1584.88624885 hartree
xcener: -108.646637826532 hartree
chargesum: 0.0000000
charge: -0.086710 -0.086822 0.130329 -0.363869 -0.404881 0.073768 -0.168853 -0.106068 0.028461 -0.104479 -0.003168 -0.225494 -0.273983 -0.128815 -0.136345 0.051061 0.088011 0.069499 0.080003 0.078901 0.090210 0.122012 0.129386 0.069565 0.076265 0.150960 0.086599 0.095294 0.068650 0.124249 0.146244 0.168759 0.161264
qa: -0.0867 -0.0868 0.1303 -0.3639 -0.4049 0.0738 -0.1689 -0.1061 0.0285 -0.1045 -0.0032 -0.2255 -0.2740 -0.1288 -0.1363 0.0511 0.0880 0.0695 0.0800 0.0789 0.0902 0.1220 0.1294 0.0696 0.0763 0.1510 0.0866 0.0953 0.0686 0.1242 0.1462 0.1688 0.1613
va: 1.2390 1.2167 3.3333 2.8667 3.0253 3.7421 3.8771 3.8954 3.4355 3.8921 3.9573 3.9013 3.9300 4.0642 4.0490 4.0684 3.8723 4.0321 1.0301 1.0312 1.0067 1.0127 1.0044 1.0070 1.0066 0.9976 1.0015 1.0056 1.0036 1.0202 1.0033 0.9942 0.9951
dispcorr: -0.018711340 hartree
energy: -1589.184325181608
dipole: -25.71824 24.71817 -1.00007 3.15463 -2.45503 0.69960 -11.32815 11.87046 0.54231
magnitude: 1.33554 au
magnitude: 3.39468 debye
