program: Orca
programVersion: 4.2.1
elementType: Cl Cl N N N C C C C C C C C C C C C C H H H H H H H H H H H H H H H
charge: 0
multiplicity: 1
keywords: wb97x-d3
keywords: def2-TZVPP
keywords: def2/J RIJCOSX GRIDX6 NOFINALGRIDX
keywords: grid4 nofinalgrid
keywords: scfconv7
keywords: smallprint printgap noloewdin
keywords: NOSOSCF
formula: C13H15Cl2N3
InChI: InChI=1S/C13H15Cl2N3/c1-2-3-10(7-18-9-16-8-17-18)12-5-4-11(14)6-13(12)15/h4-6,8-10H,2-3,7H2,1H3
33 atoms
Cl -0.3203 -0.3873 2.254008
Cl 3.98029 1.737177 -0.093769
N  -1.109339 -2.200097 -0.824165
N  -1.61239 -3.016615 0.103686
N  0.537776 -3.504736 -0.280062
C  -1.832349 0.132608 -0.435763
C  -2.779229 1.211837 -0.971576
C  -1.886975 -1.101708 -1.348552
C  -0.394447 0.573001 -0.295977
C  -3.124836 2.324656 0.015315
C  0.371686 0.352302 0.845741
C  0.259085 1.161075 -1.378405
C  -1.9917 3.271129 0.385187
C  1.711465 0.708283 0.923526
C  1.592349 1.525608 -1.337612
C  0.174911 -2.496201 -1.036734
C  2.30991 1.294481 -0.175594
C  -0.592876 -3.782337 0.397204
H  -2.214218 -0.177834 0.539069
H  -2.390543 1.643178 -1.898379
H  -3.713444 0.714753 -1.248115
H  -1.515826 -0.866913 -2.34677
H  -2.914824 -1.447031 -1.452744
H  -3.936557 2.910384 -0.423778
H  -3.537824 1.877774 0.924748
H  -0.288122 1.342275 -2.29501
H  -1.207691 2.782536 0.962675
H  -2.370058 4.094636 0.992916
H  -1.525678 3.706964 -0.50063
H  2.275093 0.524045 1.827406
H  2.059746 1.980092 -2.20001
H  0.790709 -1.967287 -1.747267
H  -0.668775 -4.575605 1.124503
elementType: Cl N C H
totalener: -1589.16392317 hartree
nucrepener: 1600.53839608 hartree
electener: -3189.70231926 hartree
oneelecener: -5358.03576976 hartree
twoeener: 2168.33345050 hartree
cpcmener: -0.02199293 hartree
kineticenergy: 1584.89063681 hartree
xcener: -108.645823283493 hartree
chargesum: -0.0000000
charge: -0.082613 -0.087424 0.121070 -0.347846 -0.402520 0.125105 -0.160895 -0.106766 -0.097085 -0.110587 0.061428 -0.175590 -0.270954 -0.119766 -0.166608 0.046796 0.101256 0.057161 0.071733 0.084323 0.084320 0.131371 0.117143 0.075316 0.057641 0.137546 0.080830 0.099830 0.080464 0.121498 0.146053 0.169478 0.158294
qa: -0.0826 -0.0874 0.1211 -0.3478 -0.4025 0.1251 -0.1609 -0.1068 -0.0971 -0.1106 0.0614 -0.1756 -0.2710 -0.1198 -0.1666 0.0468 0.1013 0.0572 0.0717 0.0843 0.0843 0.1314 0.1171 0.0753 0.0576 0.1375 0.0808 0.0998 0.0805 0.1215 0.1461 0.1695 0.1583
va: 1.2385 1.2159 3.3476 2.8762 3.0215 3.6991 3.9344 3.8845 3.4595 3.8877 3.8469 3.9268 3.9420 4.0693 4.0512 4.0738 3.8572 4.0563 1.0509 1.0067 1.0099 0.9945 1.0186 1.0039 1.0088 1.0078 0.9952 1.0051 1.0038 1.0216 1.0034 0.9946 0.9963
dispcorr: -0.019218336 hartree
energy: -1589.183141509151
dipole: -24.91794 23.74561 -1.17233 9.88700 -8.34670 1.54030 -10.23848 8.61161 -1.62687
magnitude: 2.52855 au
magnitude: 6.42707 debye
