program: Orca
programVersion: 4.2.1
elementType: Cl Cl N N N C C C C C C C C C C C C C H H H H H H H H H H H H H H H
charge: 0
multiplicity: 1
keywords: wb97x-d3
keywords: def2-TZVPP
keywords: def2/J RIJCOSX GRIDX6 NOFINALGRIDX
keywords: grid4 nofinalgrid
keywords: scfconv7
keywords: smallprint printgap noloewdin
keywords: NOSOSCF
formula: C13H15Cl2N3
InChI: InChI=1S/C13H15Cl2N3/c1-2-3-10(7-18-9-16-8-17-18)12-5-4-11(14)6-13(12)15/h4-6,8-10H,2-3,7H2,1H3
33 atoms
Cl -0.06155 0.429663 2.811589
Cl 4.131153 1.65795 -0.258134
N  -1.316883 -2.196665 -0.881246
N  -1.268747 -2.987693 0.191218
N  0.03486 -3.804544 -1.438855
C  -1.652645 -0.018497 0.219972
C  -2.591088 1.195121 0.311079
C  -2.10185 -0.988069 -0.872666
C  -0.205291 0.390811 0.096062
C  -2.626949 2.113789 -0.904246
C  0.591278 0.613809 1.218906
C  0.400551 0.600612 -1.140459
C  -3.577418 3.285561 -0.700653
C  1.919311 1.000364 1.123427
C  1.721852 0.990367 -1.270369
C  -0.530662 -2.697019 -1.843987
C  2.478755 1.182467 -0.128015
C  -0.449216 -3.938746 -0.187482
H  -1.762893 -0.568963 1.156321
H  -3.6026 0.828224 0.516394
H  -2.30477 1.777892 1.190804
H  -2.045482 -0.557456 -1.872642
H  -3.147983 -1.249674 -0.701507
H  -1.624287 2.494957 -1.112674
H  -2.936687 1.559547 -1.795697
H  -0.175733 0.466466 -2.046581
H  -3.594044 3.940718 -1.571379
H  -3.281772 3.888582 0.159053
H  -4.59898 2.944376 -0.525976
H  2.50717 1.154748 2.016838
H  2.156744 1.14034 -2.248272
H  -0.406328 -2.229118 -2.80872
H  -0.190289 -4.759125 0.4631
totalener: -1589.14107426 hartree
nucrepener: 1556.44548233 hartree
electener: -3145.58655659 hartree
oneelecener: -5269.62267345 hartree
twoeener: 2124.03611685 hartree
kineticenergy: 1584.88493045 hartree
xcener: -108.643866042455 hartree
chargesum: -0.0000000
charge: -0.068820 -0.068573 0.126620 -0.313516 -0.335184 0.117938 -0.155506 -0.195798 0.094606 -0.093785 -0.027313 -0.246636 -0.269010 -0.130002 -0.118467 0.055254 0.079876 0.068496 0.100364 0.078391 0.080994 0.103098 0.120176 0.071605 0.055064 0.123756 0.087854 0.080584 0.077544 0.113637 0.122775 0.131114 0.132864
qa: -0.0688 -0.0686 0.1266 -0.3135 -0.3352 0.1179 -0.1555 -0.1958 0.0946 -0.0938 -0.0273 -0.2466 -0.2690 -0.1300 -0.1185 0.0553 0.0799 0.0685 0.1004 0.0784 0.0810 0.1031 0.1202 0.0716 0.0551 0.1238 0.0879 0.0806 0.0775 0.1136 0.1228 0.1311 0.1329
va: 1.2583 1.2362 3.3185 2.8624 3.0673 3.6661 3.8864 3.9630 3.4555 3.8450 4.0467 3.9140 3.9710 4.0618 4.0950 4.0703 3.9539 4.0489 1.0454 1.0114 1.0197 0.9948 1.0066 1.0057 1.0048 1.0027 1.0044 1.0029 1.0025 1.0235 1.0121 1.0038 1.0005
dispcorr: -0.017038839 hartree
energy: -1589.158113097741
dipole: -29.09023 28.09729 -0.99294 7.15663 -6.08416 1.07247 -12.15137 11.48494 -0.66643
magnitude: 1.60632 au
magnitude: 4.08293 debye
