program: Orca
programVersion: 4.2.1
elementType: Cl Cl N N N C C C C C C C C C C C C C H H H H H H H H H H H H H H H
charge: 0
multiplicity: 1
keywords: wb97x-d3
keywords: def2-TZVPP
keywords: def2/J RIJCOSX GRIDX6 NOFINALGRIDX
keywords: grid4 nofinalgrid
keywords: scfconv7
keywords: smallprint printgap noloewdin
keywords: NOSOSCF
formula: C13H15Cl2N3
InChI: InChI=1S/C13H15Cl2N3/c1-2-3-10(7-18-9-16-8-17-18)12-5-4-11(14)6-13(12)15/h4-6,8-10H,2-3,7H2,1H3
33 atoms
Cl -0.217957 0.710997 2.846845
Cl 4.106626 1.627567 -0.148795
N  -1.318607 -2.22796 -0.887269
N  -0.68518 -2.559497 -2.015704
N  -0.233086 -4.048462 -0.404346
C  -1.678135 -0.058007 0.262106
C  -2.599311 1.17489 0.290708
C  -2.139135 -1.042226 -0.812881
C  -0.223595 0.331316 0.151493
C  -2.538526 2.078727 -0.934816
C  0.510513 0.716503 1.272848
C  0.446735 0.365528 -1.069172
C  -3.467412 3.277301 -0.79857
C  1.835253 1.115628 1.196134
C  1.769086 0.759153 -1.178238
C  -1.034781 -3.126643 0.065066
C  2.457679 1.134424 -0.038698
C  -0.047628 -3.654968 -1.680024
H  -1.812708 -0.559535 1.225143
H  -3.629221 0.831552 0.438573
H  -2.35423 1.762593 1.17859
H  -2.133038 -0.606558 -1.809672
H  -3.173098 -1.326983 -0.603226
H  -1.514757 2.428834 -1.085664
H  -2.807094 1.523325 -1.837946
H  -0.062499 0.062396 -1.973169
H  -4.506016 2.965325 -0.678112
H  -3.417192 3.920305 -1.676788
H  -3.204383 3.884064 0.0691
H  2.371221 1.403963 2.088799
H  2.257904 0.766429 -2.141883
H  -1.427414 -3.074702 1.069174
H  0.574076 -4.188783 -2.381202
totalener: -1589.14081356 hartree
nucrepener: 1557.63925682 hartree
electener: -3146.78007039 hartree
oneelecener: -5271.95565252 hartree
twoeener: 2125.17558213 hartree
kineticenergy: 1584.88414698 hartree
xcener: -108.643908944726 hartree
chargesum: -0.0000000
charge: -0.077767 -0.069380 0.112211 -0.317270 -0.332186 0.092885 -0.185625 -0.174885 0.052624 -0.082776 -0.028617 -0.168108 -0.268039 -0.129443 -0.129256 0.052661 0.083592 0.071116 0.084516 0.075752 0.085143 0.122608 0.120492 0.073026 0.056400 0.126188 0.075983 0.089254 0.080005 0.114856 0.125371 0.135733 0.132935
qa: -0.0778 -0.0694 0.1122 -0.3173 -0.3322 0.0929 -0.1856 -0.1749 0.0526 -0.0828 -0.0286 -0.1681 -0.2680 -0.1294 -0.1293 0.0527 0.0836 0.0711 0.0845 0.0758 0.0851 0.1226 0.1205 0.0730 0.0564 0.1262 0.0760 0.0893 0.0800 0.1149 0.1254 0.1357 0.1329
va: 1.2525 1.2352 3.3271 2.8419 3.0720 3.7406 3.9043 3.8997 3.4335 3.8395 4.0268 3.8913 3.9667 4.0716 4.0929 4.0772 3.9393 4.0410 1.0244 1.0131 1.0211 1.0034 0.9981 1.0079 1.0096 1.0238 1.0022 1.0047 1.0026 1.0226 1.0109 1.0032 1.0001
dispcorr: -0.017130010 hartree
energy: -1589.157943571624
dipole: -28.57113 27.41083 -1.16030 5.76224 -4.90243 0.85981 -11.32900 11.27083 -0.05816
magnitude: 1.44532 au
magnitude: 3.67370 debye
