program: Gaussian 09
title: 000030575
version: EM64L-G09RevD.01
frameworkgroup: C1[X(C19H29BrO)]
method: RPBEPBE
basis: SDD
operation: Freq
keyword: #p
keyword: freq=noraman
keyword: PBEPBE/SDD
title: #p freq=noraman PBEPBE/SDD
converged: YES YES NO NO
title: Mulliken charges:
elementType: Br O C C C C C C C C C C C C C C C C C C C H H H H H H H H H H H H H H H H H H H H H H H H H H H H H
charge: -0.035972 -0.264256 -0.209340 -0.444480 -0.442902 -0.396515 -0.397280 -0.383568 0.550310 -0.404859 -0.475359 0.431417 -0.398652 -0.433497 -0.100393 -0.257891 -0.732830 -0.396576 -0.340977 -0.352138 -0.693833 0.201373 0.196374 0.215821 0.215464 0.196974 0.192426 0.201530 0.201312 0.192707 0.201196 0.188414 0.230438 0.234810 0.260021 0.233351 0.221799 0.189421 0.200568 0.215350 0.203538 0.291969 0.293836 0.184949 0.184973 0.198762 0.196190 0.208994 0.210005 0.217024
chargesum: 0.00000
title: Mulliken charges with hydrogens summed into heavy atoms:
elementType: Br O C C C C C C C C C C C C C C C C C C C
charge: -0.035972 -0.264256 -0.007967 -0.032285 -0.030463 -0.002560 -0.003261 0.006043 0.550310 -0.174421 -0.240548 0.431417 -0.138631 -0.200147 0.121406 0.132098 -0.147026 0.022312 0.028944 0.042814 -0.057809
polarizability: 3.04738243e+02 2.27664214e+01 2.05178768e+02 -4.24336418e-01 -7.89971031e+00 1.76263217e+02
1716.lowfreq: -6.0176 -3.5065 -0.0006 0.0000 0.0006 4.2729 15.4763 16.4716 28.4895
frequency: 14.1449 15.9598 28.4049 34.3826 39.3117 52.4835 66.8837 77.6832 86.7922 100.6459 102.7047 129.8342 141.8603 175.5550 189.2156 206.5617 222.0816 229.2632 240.2581 263.3200 286.5176 322.1339 343.2615 389.6474 406.1203 413.2202 433.1943 465.0248 480.8040 493.4821 521.4561 543.3200 593.7082 634.1644 647.1523 730.3964 752.9281 764.4681 768.6639 785.5715 792.0446 819.8462 833.8732 840.7884 852.6798 855.2103 861.7182 890.2023 892.7092 893.9157 920.5723 955.5591 961.4779 968.3002 981.5791 989.6177 1002.0253 1012.9632 1025.5339 1050.3839 1052.2591 1068.2975 1070.8761 1076.3177 1077.7540 1102.7525 1114.1172 1122.9576 1137.8799 1150.3859 1165.7226 1179.6029 1184.7797 1200.2644 1204.2049 1207.7793 1224.8452 1230.2525 1249.6785 1257.7166 1259.0209 1263.3893 1276.5534 1279.0951 1285.3384 1291.7010 1304.0968 1308.4733 1319.3451 1326.7076 1328.7459 1335.6727 1340.1995 1345.9649 1352.3260 1355.9856 1382.4963 1388.1935 1392.7103 1412.9354 1423.6304 1461.0868 1463.7398 1464.5620 1466.5422 1468.4959 1469.9157 1476.4332 1477.1458 1477.2842 1485.6853 1491.8101 1498.4431 1580.8673 1618.1207 2926.1061 2946.5331 2952.8915 2955.6297 2964.7143 2965.4751 2965.7026 2966.2452 2970.4525 2971.7959 2972.5753 2979.2396 2990.1994 2996.3850 3024.3986 3025.2115 3027.5900 3031.6319 3033.0664 3043.5997 3056.7554 3061.5536 3069.8419 3072.3234 3107.5346 3119.1016 3132.2399 3145.1346 3151.8922
redmass: 3.5900 3.3905 1.6189 5.6499 6.4062 3.7570 3.3401 3.9812 3.5050 3.5927 1.6745 2.6926 6.0813 3.0335 3.3859 4.3062 1.8012 1.1194 4.3679 3.2523 4.5161 3.5382 1.8007 4.0091 2.9158 3.6596 3.1380 2.9366 1.6874 3.0191 3.1925 3.7169 3.4755 6.8678 4.1107 1.0695 3.5355 2.2235 1.2084 1.4616 2.5896 3.0142 2.4414 1.9376 1.1976 1.2759 1.6535 1.8891 2.0488 1.6145 1.9264 2.3726 1.4218 1.1562 1.3833 2.4374 3.9216 2.8256 3.4507 1.5849 1.5163 3.1989 1.2395 2.4892 2.7332 1.5896 2.4639 2.2747 1.8968 1.4562 1.5666 1.4628 1.2380 1.6161 1.9029 1.9484 1.1809 1.5286 1.2979 1.2875 1.2355 1.3019 1.3738 1.0894 1.4749 1.1001 1.2510 1.2462 1.3308 1.3324 1.3264 1.3709 1.4889 1.4886 1.6039 1.5203 2.2594 1.2672 2.0844 2.3220 1.1065 1.0885 1.0885 1.0888 1.0662 1.0759 1.0844 1.0990 1.0477 1.0650 1.0784 1.0928 2.5584 6.5585 6.3966 1.0564 1.0834 1.0804 1.0586 1.0640 1.0630 1.0593 1.0642 1.0572 1.0647 1.0383 1.1043 1.0602 1.0979 1.0965 1.1031 1.0955 1.0996 1.1031 1.1035 1.1043 1.0564 1.1010 1.0992 1.0871 1.0872 1.0959 1.0961 1.1104
irintensity: 0.0320 0.0998 0.0579 0.0458 0.3277 0.2148 0.0653 0.5324 0.6400 0.9895 0.5737 0.3769 0.6721 1.2591 3.8556 0.3874 0.0575 0.0004 2.0301 4.9060 0.3155 3.8815 0.2359 1.2481 0.4838 0.4136 0.7083 1.4226 1.5927 1.5024 12.2450 22.4188 62.3458 1.0652 29.1605 10.0449 5.1370 1.7276 0.2949 0.8129 1.3878 4.2883 15.7899 24.4957 0.7709 3.5921 5.8482 7.5014 1.1486 3.0356 1.0780 19.6100 0.6498 1.7765 0.1943 18.9079 48.8283 4.6878 51.7625 0.5125 0.5484 89.6466 0.0121 0.4777 22.7181 5.2451 0.0106 5.7537 7.9424 1.3410 2.2324 0.9427 11.1038 5.3157 10.4173 1.2019 14.4334 0.0724 2.5713 1.6985 0.7120 2.1319 6.3169 0.9161 1.3046 1.4279 0.2781 11.1515 6.0227 0.6640 12.6433 0.1240 0.6841 2.5096 0.6714 1.8439 5.8062 12.5404 3.2845 8.0686 10.7238 3.0178 5.6352 10.5643 0.3045 0.8957 20.9843 2.7183 9.9841 6.0507 4.8727 15.9667 23.8411 0.9923 10.5053 34.0187 35.7871 7.7592 15.1075 40.8586 51.0029 14.8165 31.1328 56.8859 41.3936 29.4094 33.7088 42.8692 2.9624 93.8005 11.4703 83.0969 0.6638 1.8564 125.9954 40.8707 12.2673 109.4731 53.5452 13.4757 16.9150 25.3768 5.0851 4.5728
temp: 298.150 k
press: 1.00000 atm
elementType: 35 8 6 6 6 6 6 6 6 6 6 6 6 6 6 6 6 6 6 6 6 1 1 1 1 1 1 1 1 1 1 1 1 1 1 1 1 1 1 1 1 1 1 1 1 1 1 1 1 1
symmnumber: 1
zpe: 1143453.9 jmol-1
zpe.correction: 0.435519 hartree
zpe.thermalcorrener: 0.458637 hartree
zpe.thermalcorrenthalpy: 0.459581 hartree
zpe.thermalcorrgfe: 0.377728 hartree
zpe.sumelectzpe: -828.468231 hartree
zpe.sumelectthermal: -828.445113 hartree
zpe.sumelectthermalent: -828.444169 hartree
zpe.sumelectthermalfe: -828.526022 hartree
dipole: 3.7344 2.0338 1.0561
dipole: 4.3815
quadrupole: -139.9973 -143.0571 -134.4385
quadrupole: -9.5756 -2.8751 -3.2494
quadrupole: -0.8330 -3.8928 4.7258 -9.5756 -2.8751 -3.2494
hfenergy: -828.90375 hartree
pointgroup: C01 [X(C19H29Br1O1)]
dipole: -1.3338231 1.0367643 -0.3428329 debye
polarizability: 295.9222763|-36.3073504|212.6159388|-1.6124939|10.4969699|177.6420137 unknown
InChI: InChI=1S/C19H29BrO/c1-2-3-7-14-21-19(15-20)18-12-10-17(11-13-18)16-8-5-4-6-9-16/h10-13,16,19H,2-9,14-15H2,1H3
charge 0 multiplicity 1
50 atoms
Br 3.712753 -4.20266 -0.150815
O  2.808919 -1.033417 0.25503
C  -3.683315 0.104431 -0.450744
C  -4.56462 -0.630128 0.602004
C  -3.741109 1.643622 -0.218832
C  -6.018016 -0.09928 0.600783
C  -5.195131 2.171249 -0.217194
C  -6.062627 1.430344 0.827527
C  -2.246763 -0.412441 -0.466261
C  -1.412977 -0.30694 0.680407
C  -1.694533 -0.997099 -1.634096
C  0.461115 -1.350848 -0.512839
C  -0.08206 -0.769231 0.660713
C  -0.359497 -1.459408 -1.660125
C  1.90105 -1.879117 -0.5225
C  3.123157 0.246941 -0.404524
C  1.93308 -3.265834 0.128723
C  4.126607 0.988808 0.482494
C  4.534612 2.358111 -0.108146
C  5.551839 3.112995 0.778094
C  5.95397 4.48497 0.19538
H  -4.129025 -0.095033 -1.449097
H  -4.123831 -0.487029 1.610058
H  -4.550432 -1.718996 0.401918
H  -3.143751 2.157366 -0.996815
H  -3.266073 1.881553 0.755188
H  -6.493086 -0.33617 -0.374162
H  -6.609367 -0.620768 1.378364
H  -5.199325 3.260598 -0.018017
H  -5.638586 2.029454 -1.224887
H  -7.107762 1.79355 0.785666
H  -5.683213 1.659151 1.845264
H  -1.807436 0.146118 1.597909
H  -2.315645 -1.083343 -2.534297
H  0.559033 -0.663844 1.543698
H  0.047018 -1.899217 -2.580256
H  2.255404 -1.956639 -1.5743
H  3.557625 0.046568 -1.409478
H  2.194833 0.843328 -0.53911
H  5.021083 0.350723 0.61717
H  3.679887 1.129739 1.486159
H  1.184957 -3.939279 -0.31358
H  1.808386 -3.194344 1.219857
H  4.970486 2.213873 -1.119017
H  3.631983 2.990216 -0.244396
H  6.456077 2.484647 0.908765
H  5.120134 3.250727 1.790323
H  5.071447 5.143457 0.085866
H  6.413549 4.371794 -0.804756
H  6.683077 5.00273 0.845384
