program: Orca
programVersion: 4.2.1
elementType: Cl Cl N N N C C C C C C C C C C C C C H H H H H H H H H H H H H H H
charge: 0
multiplicity: 1
keywords: wb97x-d3
keywords: def2-TZVPP
keywords: def2/J RIJCOSX GRIDX6 NOFINALGRIDX
keywords: grid4 nofinalgrid
keywords: scfconv7
keywords: smallprint printgap noloewdin
keywords: NOSOSCF
formula: C13H15Cl2N3
InChI: InChI=1S/C13H15Cl2N3/c1-2-3-10(7-18-9-16-8-17-18)12-5-4-11(14)6-13(12)15/h4-6,8-10H,2-3,7H2,1H3
33 atoms
Cl -0.333096 0.929233 2.910282
Cl 4.054642 1.523604 -0.074952
N  -1.196367 -2.347827 -0.386321
N  -1.81281 -2.60574 -1.543244
N  0.248942 -3.486708 -1.545055
C  -1.767539 -0.026311 0.340577
C  -2.663441 0.380863 -0.834634
C  -1.814373 -1.537271 0.630986
C  -0.324062 0.404871 0.237506
C  -3.059981 1.856031 -0.845786
C  0.408786 0.829614 1.344873
C  0.371937 0.311915 -0.96624
C  -1.934813 2.850518 -1.101206
C  1.747623 1.181576 1.262368
C  1.709236 0.64611 -1.08008
C  0.03608 -2.875167 -0.407935
C  2.389911 1.08935 0.041021
C  -0.910532 -3.290642 -2.204883
H  -2.201405 0.435387 1.232006
H  -2.222841 0.103007 -1.793649
H  -3.578496 -0.213519 -0.768964
H  -2.848424 -1.864452 0.742526
H  -1.301209 -1.743116 1.571442
H  -3.824215 1.985471 -1.616364
H  -3.551384 2.101216 0.101109
H  -0.14456 -0.032651 -1.852063
H  -1.210272 2.879023 -0.288461
H  -2.335316 3.858553 -1.212728
H  -1.389634 2.61187 -2.015796
H  2.278834 1.519276 2.140705
H  2.21596 0.558417 -2.030495
H  0.729358 -2.787952 0.414681
H  -1.100543 -3.671392 -3.196219
totalener: -1589.14046658 hartree
nucrepener: 1585.05462048 hartree
electener: -3174.19508705 hartree
oneelecener: -5326.81225959 hartree
twoeener: 2152.61717253 hartree
kineticenergy: 1584.88668987 hartree
xcener: -108.644891949702 hartree
chargesum: 0.0000000
charge: -0.073649 -0.066766 0.125003 -0.324525 -0.325092 0.082428 -0.143814 -0.120236 -0.033401 -0.114978 0.002402 -0.189411 -0.250449 -0.137895 -0.111780 0.033273 0.086931 0.058745 0.072775 0.082365 0.085402 0.114950 0.120022 0.073836 0.050834 0.129280 0.083829 0.095381 0.074701 0.114899 0.127479 0.143863 0.133601
qa: -0.0736 -0.0668 0.1250 -0.3245 -0.3251 0.0824 -0.1438 -0.1202 -0.0334 -0.1150 0.0024 -0.1894 -0.2504 -0.1379 -0.1118 0.0333 0.0869 0.0587 0.0728 0.0824 0.0854 0.1149 0.1200 0.0738 0.0508 0.1293 0.0838 0.0954 0.0747 0.1149 0.1275 0.1439 0.1336
va: 1.2568 1.2377 3.3020 2.8455 3.0557 3.7539 3.8986 3.9185 3.4724 3.9048 3.9628 3.9076 3.9396 4.0765 4.0663 4.0810 3.9331 4.0431 1.0348 1.0211 1.0165 1.0117 1.0061 1.0053 1.0108 1.0095 0.9962 1.0067 1.0061 1.0232 1.0099 1.0002 1.0012
dispcorr: -0.018992392 hartree
energy: -1589.159458970279
dipole: -24.34166 23.67077 -0.67089 2.19010 -1.68233 0.50777 -11.87388 12.32493 0.45105
magnitude: 0.95465 au
magnitude: 2.42654 debye
