program: Orca
programVersion: 4.2.1
elementType: Cl Cl N N N C C C C C C C C C C C C C H H H H H H H H H H H H H H H
charge: 0
multiplicity: 1
keywords: wb97x-d3
keywords: def2-TZVPP
keywords: def2/J RIJCOSX GRIDX6 NOFINALGRIDX
keywords: grid4 nofinalgrid
keywords: scfconv7
keywords: smallprint printgap noloewdin
keywords: NOSOSCF
formula: C13H15Cl2N3
InChI: InChI=1S/C13H15Cl2N3/c1-2-3-10(7-18-9-16-8-17-18)12-5-4-11(14)6-13(12)15/h4-6,8-10H,2-3,7H2,1H3
33 atoms
Cl 0.166555 0.600833 3.029454
Cl 4.148364 1.427201 -0.435323
N  -1.301714 -2.21197 -0.285869
N  -0.039638 -2.645307 -0.325507
N  -1.125296 -3.242533 -2.1934
C  -1.65018 0.098512 0.592007
C  -2.625133 0.612477 -0.467951
C  -1.780431 -1.416994 0.817456
C  -0.20762 0.465518 0.339188
C  -2.679307 2.132563 -0.564616
C  0.690168 0.696054 1.378644
C  0.30913 0.527516 -0.951919
C  -3.705831 2.61118 -1.580553
C  2.025372 0.993855 1.15712
C  1.636435 0.818333 -1.208033
C  -1.935324 -2.576305 -1.411229
C  2.489336 1.055186 -0.144081
C  0.022835 -3.254799 -1.483972
H  -1.955876 0.551297 1.539699
H  -2.4029 0.191132 -1.45316
H  -3.623649 0.241495 -0.211006
H  -2.827443 -1.670181 0.996345
H  -1.214116 -1.718545 1.696977
H  -2.915385 2.546011 0.420355
H  -1.694226 2.525916 -0.825807
H  -0.34114 0.3357 -1.795341
H  -3.731475 3.699098 -1.636811
H  -4.710532 2.271754 -1.323313
H  -3.479451 2.236817 -2.580206
H  2.691491 1.170248 1.989331
H  2.002909 0.855536 -2.223973
H  -2.972889 -2.350495 -1.605775
H  0.926433 -3.734258 -1.825936
totalener: -1589.14157152 hartree
nucrepener: 1568.65110265 hartree
electener: -3157.79267417 hartree
oneelecener: -5294.17123664 hartree
twoeener: 2136.37856247 hartree
kineticenergy: 1584.88583850 hartree
xcener: -108.642890826189 hartree
chargesum: 0.0000000
charge: -0.079432 -0.071647 0.108984 -0.299830 -0.327241 0.137658 -0.244972 -0.127723 0.044282 -0.084429 -0.012876 -0.198038 -0.262360 -0.132039 -0.122869 0.014374 0.088789 0.061482 0.077873 0.072852 0.083595 0.117161 0.128450 0.065508 0.074594 0.125767 0.090712 0.074203 0.077366 0.112515 0.123272 0.150819 0.133198
qa: -0.0794 -0.0716 0.1090 -0.2998 -0.3272 0.1377 -0.2450 -0.1277 0.0443 -0.0844 -0.0129 -0.1980 -0.2624 -0.1320 -0.1229 0.0144 0.0888 0.0615 0.0779 0.0729 0.0836 0.1172 0.1285 0.0655 0.0746 0.1258 0.0907 0.0742 0.0774 0.1125 0.1233 0.1508 0.1332
va: 1.2536 1.2332 3.3147 2.8436 3.0663 3.6518 3.9317 3.8957 3.4882 3.8830 4.0428 3.9287 3.9502 4.0851 4.0744 4.0760 3.9410 4.0356 1.0353 1.0045 1.0084 1.0022 1.0231 1.0090 1.0115 1.0042 1.0062 1.0025 1.0021 1.0226 1.0104 0.9972 1.0015
dispcorr: -0.017764910 hartree
energy: -1589.159336428706
dipole: -30.54938 29.34282 -1.20655 3.98921 -3.32705 0.66217 -11.84567 12.12178 0.27612
magnitude: 1.40374 au
magnitude: 3.56801 debye
