program: Orca
programVersion: 4.2.1
elementType: Cl N N N N C C C C C C C C C C C C C C C H H H H H H H H H H H H H H H H H
charge: 0
multiplicity: 1
keywords: wb97x-d3
keywords: def2-TZVPP
keywords: def2/J RIJCOSX GRIDX6 NOFINALGRIDX
keywords: grid4 nofinalgrid
keywords: scfconv7
keywords: smallprint printgap noloewdin
keywords: NOSOSCF
formula: C15H17ClN4
InChI: InChI=1S/C15H17ClN4/c1-2-3-8-15(9-17,10-20-12-18-11-19-20)13-4-6-14(16)7-5-13/h4-7,11-12H,2-3,8,10H2,1H3
37 atoms
Cl -4.104502 2.733016 0.635437
N  -0.147793 -2.06429 -0.432536
N  0.25129 -2.258922 -1.694585
N  -1.988677 -2.318355 -1.560029
N  2.448901 0.152111 2.864472
C  1.151815 -0.226633 0.625049
C  2.092068 0.148907 -0.541016
C  0.768322 -1.73675 0.624723
C  3.479848 -0.477161 -0.488163
C  -0.133395 0.593557 0.637529
C  4.287551 -0.14686 -1.737874
C  1.875713 -0.001116 1.877661
C  -0.681293 1.072628 -0.547809
C  -0.841903 0.781172 1.820886
C  5.711557 -0.675029 -1.667757
C  -1.902343 1.729141 -0.555361
C  -2.060154 1.440836 1.83069
C  -1.481358 -2.086672 -0.375857
C  -2.58238 1.909613 0.63653
C  -0.884139 -2.408469 -2.324874
H  2.188334 1.236692 -0.559487
H  1.610328 -0.140516 -1.474937
H  0.286405 -1.993811 1.566668
H  1.653619 -2.362204 0.531582
H  3.412769 -1.56452 -0.389598
H  4.021725 -0.119064 0.392086
H  4.307065 0.937338 -1.882024
H  3.782875 -0.562576 -2.614665
H  -0.172615 0.941663 -1.492783
H  -0.454922 0.413277 2.763248
H  6.257274 -0.232211 -0.832519
H  6.265959 -0.448565 -2.579163
H  5.728542 -1.758256 -1.533786
H  -2.311978 2.092364 -1.487607
H  -2.591024 1.581021 2.762048
H  -2.031828 -1.953355 0.542411
H  -0.916834 -2.599599 -3.38593
elementType: Cl N C H
totalener: -1261.10360346 hartree
nucrepener: 1642.01241029 hartree
electener: -2903.11601375 hartree
oneelecener: -4980.64133271 hartree
twoeener: 2077.52531896 hartree
cpcmener: -0.02990121 hartree
kineticenergy: 1256.94338854 hartree
xcener: -100.367387822017 hartree
chargesum: 0.0000000
charge: -0.094438 0.152173 -0.372495 -0.402190 -0.089865 0.641931 -0.212363 -0.190215 -0.138029 -0.114070 -0.081974 -0.319793 -0.203040 -0.192369 -0.288970 -0.158941 -0.157995 0.053796 0.122908 0.079761 0.124879 0.086951 0.154032 0.156274 0.078013 0.070649 0.062003 0.063900 0.147815 0.137938 0.080703 0.091500 0.079421 0.146831 0.147655 0.174404 0.163209
qa: -0.0944 0.1522 -0.3725 -0.4022 -0.0899 0.6419 -0.2124 -0.1902 -0.1380 -0.1141 -0.0820 -0.3198 -0.2030 -0.1924 -0.2890 -0.1589 -0.1580 0.0538 0.1229 0.0798 0.1249 0.0870 0.1540 0.1563 0.0780 0.0706 0.0620 0.0639 0.1478 0.1379 0.0807 0.0915 0.0794 0.1468 0.1477 0.1744 0.1632
va: 1.2102 3.2994 2.8544 3.0205 3.1261 3.5367 3.8556 3.9389 3.8755 3.6055 3.8705 4.1154 3.9593 4.0146 3.9516 4.0541 4.0292 4.0717 3.8181 4.0252 1.0050 1.0313 0.9957 1.0006 1.0150 1.0157 1.0082 1.0082 1.0024 1.0130 1.0000 1.0040 0.9997 1.0059 1.0057 0.9939 0.9946
dispcorr: -0.019964955 hartree
energy: -1261.123568416972
dipole: 34.66163 -34.34185 0.31978 -9.75225 9.43000 -0.32225 -9.88429 9.52276 -0.36153
magnitude: 0.58036 au
magnitude: 1.47515 debye
