program: Orca
programVersion: 4.2.1
elementType: Cl N N N N C C C C C C C C C C C C C C C H H H H H H H H H H H H H H H H H
charge: 0
multiplicity: 1
keywords: wb97x-d3
keywords: def2-TZVPP
keywords: def2/J RIJCOSX GRIDX6 NOFINALGRIDX
keywords: grid4 nofinalgrid
keywords: scfconv7
keywords: smallprint printgap noloewdin
keywords: NOSOSCF
formula: C15H17ClN4
InChI: InChI=1S/C15H17ClN4/c1-2-3-8-15(9-17,10-20-12-18-11-19-20)13-4-6-14(16)7-5-13/h4-7,11-12H,2-3,8,10H2,1H3
37 atoms
Cl -3.026562 3.481329 0.356975
N  -0.737087 -2.420948 -0.771135
N  -0.817387 -3.457762 0.069041
N  -2.855673 -2.604089 -0.322861
N  1.6911 -2.05361 2.028086
C  1.122267 -0.854336 -0.224322
C  2.470158 -0.368471 -0.80169
C  0.528377 -1.894831 -1.205628
C  3.173249 0.687595 0.037279
C  0.117842 0.269448 -0.019377
C  4.499156 1.11141 -0.581765
C  1.414245 -1.52533 1.043452
C  -0.657589 0.372173 1.128544
C  -0.102403 1.176156 -1.054275
C  5.201938 2.188733 0.228902
C  -1.625848 1.35823 1.253171
C  -1.064509 2.16537 -0.945689
C  -1.956213 -1.917113 -0.980882
C  -1.821613 2.248227 0.212878
C  -2.101256 -3.529359 0.301479
H  2.290132 0.013748 -1.808903
H  3.117897 -1.240641 -0.922745
H  1.220362 -2.722623 -1.347379
H  0.387351 -1.413288 -2.171946
H  3.353697 0.306478 1.047399
H  2.530932 1.565555 0.149127
H  4.324306 1.474446 -1.598647
H  5.151154 0.238401 -0.677131
H  -0.526513 -0.317171 1.952649
H  0.471617 1.123502 -1.97055
H  6.14841 2.478176 -0.228982
H  5.418491 1.846374 1.242483
H  4.587649 3.087406 0.309968
H  -2.217904 1.421454 2.155555
H  -1.218403 2.86096 -1.759007
H  -2.141161 -1.074337 -1.628514
H  -2.514708 -4.28829 0.946688
elementType: Cl N C H
totalener: -1261.10678000 hartree
nucrepener: 1642.21228488 hartree
electener: -2903.31906488 hartree
oneelecener: -4981.23755274 hartree
twoeener: 2077.91848786 hartree
cpcmener: -0.03706180 hartree
kineticenergy: 1256.95052661 hartree
xcener: -100.367791227337 hartree
chargesum: -0.0000000
charge: -0.093518 0.120439 -0.346538 -0.406443 -0.071085 0.688541 -0.245990 -0.133056 -0.105805 -0.240282 -0.077939 -0.357435 -0.121861 -0.214714 -0.286610 -0.153041 -0.147361 0.049968 0.121378 0.069771 0.105191 0.115372 0.141659 0.147707 0.074546 0.073313 0.062972 0.061729 0.137542 0.144059 0.092007 0.079689 0.080318 0.147058 0.148100 0.175983 0.164337
qa: -0.0935 0.1204 -0.3465 -0.4064 -0.0711 0.6885 -0.2460 -0.1331 -0.1058 -0.2403 -0.0779 -0.3574 -0.1219 -0.2147 -0.2866 -0.1530 -0.1474 0.0500 0.1214 0.0698 0.1052 0.1154 0.1417 0.1477 0.0745 0.0733 0.0630 0.0617 0.1375 0.1441 0.0920 0.0797 0.0803 0.1471 0.1481 0.1760 0.1643
va: 1.2113 3.3679 2.8940 3.0213 3.1192 3.5407 3.9084 3.8849 3.8357 3.6312 3.8749 4.1247 3.8874 4.0093 3.9484 4.0443 4.0209 4.0767 3.8154 4.0364 1.0048 1.0090 1.0140 0.9930 1.0155 1.0110 1.0067 1.0082 1.0147 1.0088 1.0038 1.0000 1.0002 1.0055 1.0047 0.9930 0.9940
dispcorr: -0.019724638 hartree
energy: -1261.126504642203
dipole: 32.76928 -31.42500 1.34429 0.34295 1.05378 1.39672 -6.44580 3.74607 -2.69972
magnitude: 3.32362 au
magnitude: 8.44797 debye
