program: Orca
programVersion: 4.2.1
elementType: Cl N N N N C C C C C C C C C C C C C C C H H H H H H H H H H H H H H H H H
charge: 0
multiplicity: 1
keywords: wb97x-d3
keywords: def2-TZVPP
keywords: def2/J RIJCOSX GRIDX6 NOFINALGRIDX
keywords: grid4 nofinalgrid
keywords: scfconv7
keywords: smallprint printgap noloewdin
keywords: NOSOSCF
formula: C15H17ClN4
InChI: InChI=1S/C15H17ClN4/c1-2-3-8-15(9-17,10-20-12-18-11-19-20)13-4-6-14(16)7-5-13/h4-7,11-12H,2-3,8,10H2,1H3
37 atoms
Cl -2.06049 4.953399 0.538584
N  -0.747458 -2.956393 -0.576464
N  -0.291225 -3.382088 -1.759863
N  -0.226859 -5.041503 -0.250725
N  0.775338 -1.68781 2.465047
C  0.035595 -0.691573 0.163985
C  1.272273 -0.738341 -0.761158
C  -1.121867 -1.583515 -0.355877
C  2.401238 0.184129 -0.32397
C  -0.500857 0.727282 0.303995
C  3.618607 0.063313 -1.231529
C  0.444676 -1.222364 1.465152
C  -0.649344 1.360355 1.53091
C  -0.853231 1.422608 -0.851093
C  4.752209 0.982523 -0.804804
C  -1.129688 2.66021 1.611524
C  -1.335264 2.718165 -0.78726
C  -0.696841 -3.954709 0.308743
C  -1.467784 3.330009 0.449766
C  0.004812 -4.630322 -1.511692
H  0.948464 -0.484477 -1.773109
H  1.641746 -1.764836 -0.80521
H  -1.484329 -1.184859 -1.300632
H  -1.949117 -1.559126 0.351807
H  2.698278 -0.048289 0.70419
H  2.058339 1.222399 -0.318101
H  3.327457 0.292052 -2.260694
H  3.968367 -0.972981 -1.23558
H  -0.388559 0.858402 2.453327
H  -0.746483 0.968373 -1.827924
H  5.086173 0.755304 0.209228
H  4.442339 2.028945 -0.821813
H  5.615174 0.884725 -1.464238
H  -1.232697 3.136789 2.576372
H  -1.599064 3.241155 -1.695845
H  -1.030313 -3.853989 1.329463
H  0.398222 -5.277805 -2.279272
elementType: Cl N C H
totalener: -1261.10567940 hartree
nucrepener: 1606.22826311 hartree
electener: -2867.33394251 hartree
oneelecener: -4909.03334886 hartree
twoeener: 2041.69940635 hartree
cpcmener: -0.03028022 hartree
kineticenergy: 1256.94404906 hartree
xcener: -100.365279912643 hartree
chargesum: 0.0000000
charge: -0.094542 0.096178 -0.358456 -0.416010 -0.073198 0.731048 -0.220524 -0.119919 -0.113917 -0.237307 -0.078299 -0.386069 -0.125336 -0.217379 -0.287787 -0.157201 -0.165612 0.068748 0.121255 0.075270 0.107200 0.105577 0.136761 0.160122 0.074797 0.073877 0.062106 0.062668 0.137245 0.142946 0.080186 0.079780 0.092093 0.146384 0.148134 0.184119 0.165064
qa: -0.0945 0.0962 -0.3585 -0.4160 -0.0732 0.7310 -0.2205 -0.1199 -0.1139 -0.2373 -0.0783 -0.3861 -0.1253 -0.2174 -0.2878 -0.1572 -0.1656 0.0687 0.1213 0.0753 0.1072 0.1056 0.1368 0.1601 0.0748 0.0739 0.0621 0.0627 0.1372 0.1429 0.0802 0.0798 0.0921 0.1464 0.1481 0.1841 0.1651
va: 1.2104 3.3750 2.8708 3.0335 3.1141 3.4115 3.8788 3.8374 3.8614 3.6619 3.8759 4.1074 3.9288 4.0406 3.9471 4.0350 4.0374 4.0558 3.8118 4.0318 1.0097 1.0138 1.0114 0.9984 1.0132 1.0108 1.0068 1.0077 1.0158 1.0077 1.0000 1.0004 1.0037 1.0071 1.0057 0.9911 0.9941
dispcorr: -0.018583351 hartree
energy: -1261.124262751214
dipole: 23.20451 -23.89218 -0.68767 -8.28588 9.68179 1.39590 -8.35869 7.24007 -1.11862
magnitude: 1.91644 au
magnitude: 4.87121 debye
