program: Gaussian 09
title: 000030553
version: EM64L-G09RevD.01
frameworkgroup: C1[X(C11H8O4)]
method: RPBEPBE
basis: SDD
operation: Freq
keyword: #pfreq=noraman
keyword: PBEPBE/SDD
title: #p freq=noraman PBEPBE/SDD
converged: YES YES NO NO
title: Mulliken charges:
elementType: O O O O C C C C C C C C C C C H H H H H H H H
charge: -0.259086 -0.236019 -0.147249 -0.265570 0.371936 0.183806 -0.323838 0.047317 -0.371937 -0.340057 0.087577 -0.250226 -0.196395 0.186233 -0.503350 0.291329 0.247717 0.269827 0.239501 0.240355 0.243231 0.242592 0.242307
chargesum: 0.00000
title: Mulliken charges with hydrogens summed into heavy atoms:
elementType: O O O O C C C C C C C C C C C
charge: -0.259086 -0.236019 -0.147249 -0.265570 0.371936 0.183806 -0.032509 0.047317 -0.124220 -0.070230 0.087577 -0.010725 0.043960 0.186233 0.224780
polarizability: 2.40435178e+02 1.38248578e+01 1.33740927e+02 8.11673779e-03 9.94734044e-03 5.53544771e+01
1716.lowfreq: -0.0007 -0.0006 0.0002 6.3075 9.9348 13.1762 23.1182 63.4579 91.7320
frequency: 22.8163 63.3869 91.7294 102.5791 126.5126 147.5330 233.1573 250.5805 293.1159 296.3703 310.5813 379.9837 398.9447 431.6372 457.3653 544.6000 546.0343 577.9322 610.9972 663.0014 705.2844 731.5095 748.9587 761.7341 769.5578 801.1747 825.0487 872.6220 892.5921 934.6769 952.9509 988.8552 994.9582 1022.7573 1076.7515 1112.5773 1118.2227 1151.5138 1172.5389 1206.9792 1211.9288 1266.6492 1299.8314 1354.8814 1408.4039 1420.7311 1436.9061 1453.4444 1459.8593 1476.3376 1555.8312 1583.3149 1602.2414 1624.4326 1708.0069 3006.2392 3107.8567 3137.3366 3138.2655 3148.0010 3157.7708 3168.8982 3181.5772
redmass: 6.4181 4.8312 3.5287 1.2942 4.4703 3.9232 5.4842 5.9977 5.2115 5.6024 7.5638 8.9027 4.5131 9.2467 3.0363 9.4735 3.3755 6.9504 7.9116 9.5313 7.5438 6.6009 4.0547 5.5556 1.3555 5.8064 9.2303 1.4231 7.1035 6.8926 1.3549 1.4055 1.3823 2.0972 3.7846 1.2649 1.7338 1.5122 1.1175 2.0276 3.4626 1.7955 2.7625 2.4472 8.9204 1.2422 2.4658 1.0499 1.0546 2.9554 6.6558 8.5007 7.0222 7.2821 12.8137 1.0297 1.1045 1.0897 1.0899 1.0904 1.1046 1.0958 1.0988
irintensity: 4.6581 0.0008 0.2194 0.1342 3.7718 1.7606 3.5861 6.9513 15.1854 6.7268 3.0139 2.4857 2.3114 0.6107 8.6404 0.5470 0.2357 22.3227 8.2108 0.2622 19.5952 5.7005 1.5990 5.8970 112.0622 8.1193 70.9103 2.5177 7.4254 42.5390 0.0181 13.3573 4.1394 3.3842 34.0062 0.0354 15.1984 46.0032 3.4100 412.9121 78.8087 6.5578 55.2441 1.8208 3.0013 24.1546 41.5681 15.4294 14.3173 10.9314 139.0685 134.7723 30.0635 174.4313 476.3607 35.4068 25.4185 0.6606 0.1025 7.8519 13.2737 15.6329 10.7210
temp: 298.150 k
press: 1.00000 atm
elementType: 8 8 8 8 6 6 6 6 6 6 6 6 6 6 6 1 1 1 1 1 1 1 1
symmnumber: 1
zpe: 432443.3 jmol-1
zpe.correction: 0.164709 hartree
zpe.thermalcorrener: 0.177511 hartree
zpe.thermalcorrenthalpy: 0.178455 hartree
zpe.thermalcorrgfe: 0.124163 hartree
zpe.sumelectzpe: -723.810267 hartree
zpe.sumelectthermal: -723.797466 hartree
zpe.sumelectthermalent: -723.796522 hartree
zpe.sumelectthermalfe: -723.850813 hartree
dipole: -2.8856 -2.7508 0.0030
dipole: 3.9866
quadrupole: -59.3706 -94.2457 -86.8748
quadrupole: 0.6077 0.0043 0.0011
quadrupole: 20.7931 -14.0820 -6.7111 0.6077 0.0043 0.0011
hfenergy: -723.9749762 hartree
pointgroup: C01 [X(C11H8O4)]
dipole: 1.1397992 1.0768909 -0.035369 debye
dipolederiv: -1.1982999 -0.5294235 0.0296593 -0.070212 -0.4557759 0.0029632 0.0275886 0.0156885 -0.2120914 -1.5372821 -0.2338286 0.0373436 -0.5249646 -0.5116532 0.0163981 0.0367501 0.0077423 -0.2702821 -0.7897299 -0.3482641 0.0150475 -0.6245882 -0.9273757 0.0199797 0.0164482 0.0124862 -0.2991787 -0.8290419 0.2001207 0.0132491 0.21032 -0.8968473 -0.0030588 0.0129993 -0.0030588 -0.329774 -0.8012617 0.0648802 0.0218746 0.185414 -0.1890844 -0.004331 0.021122 -0.0009563 -0.0040051 0.5959825 0.4044386 -0.0143195 0.0375725 0.3796575 -0.0020464 -0.0126623 -0.0122538 0.1414275 1.1014539 0.0573342 -0.0314109 0.2163278 0.1527001 -0.0068414 -0.0319279 -0.0022969 -0.0199739 -1.0695722 0.052883 0.0280904 -0.5250638 -0.4827687 0.0163851 0.0310521 0.0004433 -0.0564522 0.4176366 -0.097601 -0.0145802 0.2079915 0.1262559 -0.0069193 -0.0159005 0.0015914 -0.1256084 -0.2952637 -0.2353085 0.0045419 -0.1125496 0.0358031 0.0022013 0.0039839 0.0055732 -0.1700855 1.4463412 0.5855326 -0.0343872 0.661188 1.2493962 -0.0223902 -0.0349406 -0.0205028 0.2936359 -0.2585146 0.1737918 0.0017511 0.391682 -0.0966686 -0.011152 0.0007419 -0.005086 -0.1698803 0.0735757 -0.0005608 -0.0052998 -0.2053601 0.1742205 0.0043498 -0.0044956 -0.0013275 -0.1198872 2.2441504 -0.0881606 -0.0561404 0.0950232 1.1326078 -0.0072872 -0.0572728 -0.0018371 0.2483422 0.7937986 0.0442805 -0.0157215 -0.0216015 0.2129976 0.001081 -0.0130157 0.0001742 0.2812627 0.1510512 0.0008776 -0.0004914 0.0256809 0.0200415 -0.000206 -0.0006164 0.0004264 0.1348267 0.0805549 0.0684043 0.0017626 0.00879 -0.0593107 0.0007275 0.002025 -0.0009457 0.1561548 0.0912417 0.0035791 0.0023619 0.0406944 -0.0212232 -0.0002329 0.0022048 0.0007906 0.1773885 -0.0372797 -0.0930318 0.0061155 -0.1033278 0.0076268 0.0035658 0.006142 0.0032697 0.1696571 -0.0927524 0.0545913 0.006616 0.0516728 0.0778624 -0.0010673 0.0066469 -0.0011456 0.1562552 -0.0118817 -0.061653 0.0032773 -0.1308779 -0.0278641 0.0018842 0.0026885 0.0002373 0.1241459 -0.0375349 -0.0095527 0.0077576 0.0961265 0.0486387 0.0995405 -0.0451204 0.0798601 -0.0500732 -0.037372 -0.0133293 -0.0070975 0.090062 0.0507639 -0.1035437 0.045559 -0.0788727 -0.0558046 unknown
polarizability: 240.4142368|13.3087335|133.612034|-5.2383088|-0.7239211|55.5043109 unknown
InChI: InChI=1S/C11H8O4/c1-14-10(12)8-6-7-4-2-3-5-9(7)15-11(8)13/h2-6H,1H3
charge 0 multiplicity 1
23 atoms
O  0.675299 -1.674999 0.075747
O  -3.42544 -0.296319 0.185026
O  -1.531504 -2.309115 0.139819
O  -2.68297 1.906579 0.153705
C  1.36764 0.674014 0.045867
C  1.682663 -0.719092 0.043649
C  -0.019635 1.043483 0.08259
C  -1.048829 0.111442 0.115508
C  2.436193 1.618454 0.012316
C  3.020065 -1.17052 0.008949
C  -0.767539 -1.337313 0.114209
C  3.767681 1.17877 -0.022232
C  4.054895 -0.216584 -0.023779
C  -2.438253 0.670248 0.152406
C  -4.817533 0.215283 0.222934
H  -0.305257 2.102589 0.085922
H  2.200092 2.688657 0.014071
H  3.221987 -2.245157 0.008211
H  4.587563 1.902968 -0.047947
H  5.096135 -0.55518 -0.050901
H  -5.440263 -0.689189 0.231805
H  -5.020332 0.835299 -0.666387
H  -4.975557 0.82108 1.13101
