program: Orca
programVersion: 4.2.1
elementType: Cl N N N N C C C C C C C C C C C C C C C H H H H H H H H H H H H H H H H H
charge: 0
multiplicity: 1
keywords: wb97x-d3
keywords: def2-TZVPP
keywords: def2/J RIJCOSX GRIDX6 NOFINALGRIDX
keywords: grid4 nofinalgrid
keywords: scfconv7
keywords: smallprint printgap noloewdin
keywords: NOSOSCF
formula: C15H17ClN4
InChI: InChI=1S/C15H17ClN4/c1-2-3-8-15(9-17,10-20-12-18-11-19-20)13-4-6-14(16)7-5-13/h4-7,11-12H,2-3,8,10H2,1H3
37 atoms
Cl -3.606835 3.270742 0.324621
N  -0.356284 -2.13335 -0.749975
N  -0.413887 -3.235997 0.004059
N  -2.46387 -2.656549 -0.694321
N  1.581399 -1.598252 2.435995
C  1.186685 -0.393803 0.14933
C  2.500747 0.354883 -0.179566
C  0.886721 -1.446023 -0.948503
C  3.754142 -0.512576 -0.251787
C  0.005895 0.565799 0.247078
C  5.034255 0.313563 -0.353157
C  1.383496 -1.083193 1.427899
C  -0.221564 1.489028 -0.770984
C  -0.915101 0.4958 1.285242
C  5.127389 1.169333 -1.609434
C  -1.326381 2.322779 -0.753571
C  -2.026017 1.324464 1.316316
C  -1.593864 -1.797133 -1.152197
C  -2.227913 2.236259 0.295694
C  -1.693176 -3.51417 0.009502
H  2.634972 1.131538 0.577876
H  2.364614 0.876748 -1.128662
H  1.674424 -2.195743 -0.989426
H  0.856468 -0.935575 -1.912464
H  3.7030 -1.186447 -1.11264
H  3.817334 -1.148268 0.634694
H  5.886218 -0.36914 -0.32051
H  5.124376 0.948165 0.533171
H  0.462658 1.574752 -1.605578
H  -0.781608 -0.216603 2.08855
H  5.012681 0.56342 -2.510314
H  6.094579 1.667282 -1.672766
H  4.365759 1.949522 -1.635461
H  -1.484293 3.035269 -1.551205
H  -2.732242 1.252134 2.131423
H  -1.803685 -0.933493 -1.764789
H  -2.085945 -4.370691 0.534027
totalener: -1261.08286785 hartree
nucrepener: 1636.95844249 hartree
electener: -2898.04131034 hartree
oneelecener: -4970.89161819 hartree
twoeener: 2072.85030785 hartree
kineticenergy: 1256.93100546 hartree
xcener: -100.361412840942 hartree
chargesum: 0.0000000
charge: -0.065910 0.117469 -0.300227 -0.322544 0.026679 0.726577 -0.254912 -0.175395 -0.125344 -0.222230 -0.118740 -0.427222 -0.241779 -0.104982 -0.266042 -0.151262 -0.107066 0.028461 0.108237 0.067482 0.112390 0.089458 0.135676 0.132753 0.063343 0.104361 0.076610 0.064131 0.118525 0.136426 0.078732 0.094324 0.073320 0.124657 0.126219 0.142487 0.135335
qa: -0.0659 0.1175 -0.3002 -0.3225 0.0267 0.7266 -0.2549 -0.1754 -0.1253 -0.2222 -0.1187 -0.4272 -0.2418 -0.1050 -0.2660 -0.1513 -0.1071 0.0285 0.1082 0.0675 0.1124 0.0895 0.1357 0.1328 0.0633 0.1044 0.0766 0.0641 0.1185 0.1364 0.0787 0.0943 0.0733 0.1247 0.1262 0.1425 0.1353
va: 1.2402 3.3337 2.8651 3.0631 3.1139 3.4679 3.9118 3.9081 3.8600 3.6298 3.9035 4.1008 4.0528 3.9249 3.9242 4.0748 4.0356 4.0886 3.9291 4.0356 1.0067 1.0014 1.0178 0.9901 1.0107 1.0212 1.0088 1.0107 1.0154 1.0191 1.0015 1.0078 1.0003 1.0144 1.0126 1.0014 0.9998
dispcorr: -0.019693561 hartree
energy: -1261.102561415934
dipole: 35.84551 -34.69964 1.14587 -2.95870 4.14396 1.18526 -9.54464 8.05941 -1.48522
magnitude: 2.21895 au
magnitude: 5.64012 debye
