program: Orca
programVersion: 4.2.1
elementType: Cl N N N N C C C C C C C C C C C C C C C H H H H H H H H H H H H H H H H H
charge: 0
multiplicity: 1
keywords: wb97x-d3
keywords: def2-TZVPP
keywords: def2/J RIJCOSX GRIDX6 NOFINALGRIDX
keywords: grid4 nofinalgrid
keywords: scfconv7
keywords: smallprint printgap noloewdin
keywords: NOSOSCF
formula: C15H17ClN4
InChI: InChI=1S/C15H17ClN4/c1-2-3-8-15(9-17,10-20-12-18-11-19-20)13-4-6-14(16)7-5-13/h4-7,11-12H,2-3,8,10H2,1H3
37 atoms
Cl -2.665226 3.616308 0.276828
N  -0.819877 -2.444003 -0.660347
N  -0.892281 -3.448734 0.219091
N  -2.912417 -2.52321 -0.082264
N  1.879294 -2.050295 1.915463
C  1.187526 -0.981549 -0.367113
C  2.506507 -0.639783 -1.102218
C  0.440038 -2.045712 -1.21543
C  3.537257 0.182035 -0.333299
C  0.25949 0.208307 -0.164587
C  3.145662 1.614452 0.012462
C  1.547491 -1.585141 0.918197
C  -0.386876 0.439782 1.042972
C  -0.032833 1.045526 -1.238129
C  4.307133 2.383062 0.626841
C  -1.285703 1.485584 1.186238
C  -0.928005 2.093055 -1.110764
C  -2.037404 -1.897366 -0.822242
C  -1.551516 2.311029 0.108281
C  -2.162205 -3.461077 0.536573
H  2.259375 -0.138463 -2.041223
H  2.971908 -1.588006 -1.385727
H  1.054417 -2.938465 -1.323258
H  0.270483 -1.632441 -2.210555
H  4.440032 0.206387 -0.950832
H  3.822597 -0.349928 0.578433
H  2.304256 1.623655 0.707335
H  2.796825 2.130374 -0.887411
H  -0.196825 -0.197439 1.896748
H  0.441579 0.897015 -2.200163
H  4.019579 3.404661 0.873706
H  5.158099 2.435561 -0.054689
H  4.65186 1.907818 1.546618
H  -1.778877 1.649545 2.134113
H  -1.137308 2.737409 -1.953384
H  -2.228847 -1.060316 -1.476755
H  -2.565179 -4.175661 1.236884
totalener: -1261.08212975 hartree
nucrepener: 1666.03656960 hartree
electener: -2927.11869935 hartree
oneelecener: -5029.12907180 hartree
twoeener: 2102.01037245 hartree
kineticenergy: 1256.93401543 hartree
xcener: -100.362464961418 hartree
chargesum: -0.0000000
charge: -0.065438 0.115679 -0.299861 -0.323157 0.032760 0.694009 -0.216958 -0.156735 -0.146235 -0.291169 -0.071996 -0.431955 -0.063505 -0.246090 -0.270178 -0.113304 -0.144164 0.030292 0.115900 0.070019 0.095598 0.107628 0.129158 0.132267 0.077263 0.084829 0.071270 0.056696 0.130853 0.117449 0.088473 0.073942 0.083156 0.128214 0.126447 0.143810 0.135035
qa: -0.0654 0.1157 -0.2999 -0.3232 0.0328 0.6940 -0.2170 -0.1567 -0.1462 -0.2912 -0.0720 -0.4320 -0.0635 -0.2461 -0.2702 -0.1133 -0.1442 0.0303 0.1159 0.0700 0.0956 0.1076 0.1292 0.1323 0.0773 0.0848 0.0713 0.0567 0.1309 0.1174 0.0885 0.0739 0.0832 0.1282 0.1264 0.1438 0.1350
va: 1.2409 3.3235 2.8659 3.0635 3.1158 3.4367 3.9160 3.9102 3.8849 3.6580 3.8622 4.0945 3.8658 4.0049 3.9672 4.0418 4.0705 4.0884 3.9279 4.0334 1.0046 1.0105 1.0222 0.9902 1.0075 1.0169 1.0045 1.0083 1.0214 1.0184 1.0045 1.0033 1.0018 1.0117 1.0128 1.0007 0.9997
dispcorr: -0.020957552 hartree
energy: -1261.103087303132
dipole: 28.41349 -27.57115 0.84234 -0.32361 1.26637 0.94276 -5.56731 3.82877 -1.73853
magnitude: 2.14961 au
magnitude: 5.46388 debye
