program: Orca
programVersion: 4.2.1
elementType: Cl N N N N C C C C C C C C C C C C C C C H H H H H H H H H H H H H H H H H
charge: 0
multiplicity: 1
keywords: wb97x-d3
keywords: def2-TZVPP
keywords: def2/J RIJCOSX GRIDX6 NOFINALGRIDX
keywords: grid4 nofinalgrid
keywords: scfconv7
keywords: smallprint printgap noloewdin
keywords: NOSOSCF
formula: C15H17ClN4
InChI: InChI=1S/C15H17ClN4/c1-2-3-8-15(9-17,10-20-12-18-11-19-20)13-4-6-14(16)7-5-13/h4-7,11-12H,2-3,8,10H2,1H3
37 atoms
Cl -2.126675 4.933997 0.522312
N  -0.725895 -2.95271 -0.553709
N  -0.289862 -3.3607 -1.752082
N  -0.287147 -5.065066 -0.295879
N  0.743078 -1.654648 2.509956
C  0.057072 -0.682346 0.182015
C  1.290268 -0.738256 -0.74543
C  -1.097108 -1.583152 -0.333965
C  2.422266 0.185731 -0.319306
C  -0.487357 0.735447 0.30823
C  3.634455 0.064581 -1.234847
C  0.449265 -1.203535 1.493878
C  -0.655321 1.371713 1.531087
C  -0.84284 1.426107 -0.848598
C  4.773429 0.982964 -0.81805
C  -1.159121 2.662197 1.603987
C  -1.347811 2.712466 -0.791106
C  -0.714652 -3.986418 0.30491
C  -1.503509 3.327967 0.441545
C  -0.038885 -4.630154 -1.549098
H  0.966325 -0.497379 -1.761341
H  1.653199 -1.76685 -0.788066
H  -1.45972 -1.191613 -1.28244
H  -1.923862 -1.547615 0.376486
H  2.723439 -0.046188 0.707451
H  2.077866 1.223687 -0.309405
H  3.338099 0.290637 -2.263568
H  3.983157 -0.972123 -1.242012
H  -0.386137 0.871253 2.452041
H  -0.717622 0.970123 -1.822954
H  5.112654 0.757547 0.19402
H  4.465853 2.029596 -0.835124
H  5.631245 0.881129 -1.482511
H  -1.277737 3.144097 2.564372
H  -1.614928 3.23454 -1.699237
H  -1.017597 -3.902409 1.337308
H  0.329935 -5.26947 -2.3356
totalener: -1261.08888782 hartree
nucrepener: 1603.65506979 hartree
electener: -2864.74395761 hartree
oneelecener: -4904.17819235 hartree
twoeener: 2039.43423474 hartree
kineticenergy: 1256.92792254 hartree
xcener: -100.359038959211 hartree
chargesum: 0.0000000
charge: -0.067368 0.096431 -0.320913 -0.329499 0.024923 0.707802 -0.225073 -0.172455 -0.110499 -0.233203 -0.081746 -0.456948 -0.103101 -0.212278 -0.262017 -0.132847 -0.150824 0.059953 0.107268 0.069961 0.100042 0.107394 0.132765 0.144039 0.080191 0.071024 0.056769 0.062656 0.133469 0.122878 0.078003 0.073776 0.087679 0.126818 0.126280 0.152922 0.135730
qa: -0.0674 0.0964 -0.3209 -0.3295 0.0249 0.7078 -0.2251 -0.1725 -0.1105 -0.2332 -0.0817 -0.4569 -0.1031 -0.2123 -0.2620 -0.1328 -0.1508 0.0600 0.1073 0.0700 0.1000 0.1074 0.1328 0.1440 0.0802 0.0710 0.0568 0.0627 0.1335 0.1229 0.0780 0.0738 0.0877 0.1268 0.1263 0.1529 0.1357
va: 1.2391 3.3169 2.8478 3.0678 3.1153 3.4364 3.8839 3.8936 3.8397 3.7119 3.8902 4.0749 3.9443 4.0555 3.9519 4.0456 4.0803 4.0673 3.9263 4.0381 1.0128 1.0197 1.0132 1.0012 1.0133 1.0113 1.0067 1.0084 1.0211 1.0143 1.0030 1.0030 1.0057 1.0139 1.0135 1.0015 1.0000
dispcorr: -0.018511587 hartree
energy: -1261.107399410029
dipole: 23.57329 -23.88825 -0.31496 -8.28919 9.41139 1.12220 -8.36911 7.58420 -0.78492
magnitude: 1.40522 au
magnitude: 3.57178 debye
