program: Gaussian 09
title: 000030514
version: EM64L-G09RevD.01
frameworkgroup: C1[X(C9H10F3NO)]
method: RPBEPBE
basis: SDD
operation: Freq
keyword: #p
keyword: freq=noraman
keyword: PBEPBE/SDD
title: #p freq=noraman PBEPBE/SDD
converged: YES YES NO NO
title: Mulliken charges:
elementType: F F F O N C C C C C C C C C H H H H H H H H H H
charge: -0.169240 -0.165053 -0.169364 -0.475849 -0.635253 -0.169993 0.466979 -0.448651 -0.483072 0.308507 -0.412383 -0.382453 -0.206236 0.246966 0.204671 0.245832 0.218920 0.312912 0.237094 0.265979 0.234706 0.373114 0.308860 0.293009
chargesum: 0.00000
title: Mulliken charges with hydrogens summed into heavy atoms:
elementType: F F F O N C C C C C C C C C
charge: -0.169240 -0.165053 -0.169364 -0.102736 -0.033383 0.034678 0.466979 0.016101 -0.170161 0.308507 -0.175290 -0.116474 0.028470 0.246966
polarizability: 1.40181802e+02 5.48460375e+00 1.14419592e+02 -2.82618889e+00 -1.55158409e+00 6.65994810e+01
1716.lowfreq: -8.4190 -0.0012 -0.0008 -0.0006 3.4795 7.1895 12.1581 31.9388 83.0985
frequency: 9.6920 31.1829 83.0787 99.5003 125.2132 137.5941 229.1505 258.5350 279.3839 302.0306 313.9639 337.9920 368.7368 378.5396 432.9804 486.4915 511.4144 546.9499 601.0130 609.1249 637.4985 690.8673 701.6898 712.2381 775.0485 806.3609 844.8711 900.4643 910.9817 933.5703 952.5822 986.0964 989.0462 992.3219 1006.4447 1040.4867 1052.6554 1069.9229 1108.2421 1129.3730 1177.3509 1186.3661 1257.8818 1273.0228 1285.2731 1301.0016 1314.5335 1349.9137 1393.6416 1400.2237 1440.4134 1459.1937 1478.1031 1602.0830 1619.4274 1640.7670 2906.9586 2964.2118 3063.0974 3120.4778 3151.2363 3170.6218 3175.8329 3227.1180 3472.7763 3597.9685
redmass: 12.0409 4.6046 2.8002 4.6612 6.5209 4.5757 6.4605 4.2121 1.3532 6.1407 4.1289 4.2830 9.3207 4.1617 5.7708 5.3095 6.8867 3.1165 5.2193 11.1441 6.3986 1.3289 3.1524 2.7651 1.1083 1.5610 3.4024 3.0366 1.6299 1.4304 1.4768 3.2831 6.1038 1.8166 6.3709 3.4779 3.4819 3.3282 1.8387 1.4440 1.6544 1.2264 1.2865 1.2550 1.6974 1.8166 1.2065 1.2649 6.5018 1.6837 3.1130 1.0953 2.6017 6.2926 6.3862 1.0925 1.0830 1.0657 1.0982 1.0887 1.0919 1.0921 1.0972 1.0632 1.0464 1.0977
irintensity: 0.2771 4.6832 0.9102 1.7742 1.9102 3.2940 3.3519 3.0148 8.0015 0.1839 3.9652 8.0987 6.4801 8.6974 0.1674 2.3790 2.0211 8.3334 15.6536 14.6648 5.7141 128.3763 13.9645 27.9606 197.9927 56.9122 12.7707 64.8599 9.5026 21.2221 34.9083 135.3399 11.5002 51.3990 174.7955 43.3692 71.6026 7.2052 24.4746 22.3921 73.5157 8.6493 13.2170 46.4187 127.1601 159.7490 28.3594 3.1292 6.4239 31.5921 26.1094 9.5080 9.6988 4.8148 5.4843 40.9766 55.5959 49.0659 21.2321 11.1734 12.3817 1.6988 9.0307 163.1112 1.9707 9.3196
temp: 298.150 k
press: 1.00000 atm
elementType: 9 9 9 8 7 6 6 6 6 6 6 6 6 6 1 1 1 1 1 1 1 1 1 1
symmnumber: 1
zpe: 469012.8 jmol-1
zpe.correction: 0.178638 hartree
zpe.thermalcorrener: 0.191999 hartree
zpe.thermalcorrenthalpy: 0.192943 hartree
zpe.thermalcorrgfe: 0.136263 hartree
zpe.sumelectzpe: -777.407203 hartree
zpe.sumelectthermal: -777.393842 hartree
zpe.sumelectthermalent: -777.392898 hartree
zpe.sumelectthermalfe: -777.449578 hartree
dipole: -6.3634 3.3995 -2.1970
dipole: 7.5416
quadrupole: -65.6689 -76.8801 -84.8364
quadrupole: 4.2000 6.1974 3.5845
quadrupole: 10.1262 -1.0850 -9.0412 4.2000 6.1974 3.5845
hfenergy: -777.5858408 hartree
pointgroup: C01 [X(C9H10F3N1O1)]
dipole: -2.4303545 0.8752872 -1.4597741 debye
dipolederiv: -0.8509149 -0.0997698 0.1417347 -0.0474147 -0.3744152 0.0712108 0.1131882 0.0779959 -0.3588731 -0.4786521 0.1179793 -0.1547629 0.181139 -0.3765303 0.1193051 -0.232784 0.1119349 -0.8326745 -0.4225794 0.0829876 -0.0431561 0.1670961 -0.8327337 -0.1789643 -0.0590912 -0.1469871 -0.3809686 -0.5693989 -0.0655906 0.0165616 -0.1867972 -0.6445959 0.0479634 0.102408 0.1498573 -0.6850837 -0.6608443 -0.2529204 -0.1003469 -0.2915997 -0.4767804 0.1595482 -0.142198 0.1730326 -0.5885691 0.184705 -0.0718596 -0.0831525 0.0141873 0.4969534 -0.0422497 -0.3146285 -0.1734881 0.356758 0.3432627 0.1959661 -0.0227804 0.1420634 -0.0665867 0.0423031 -0.0466107 -0.0017792 -0.0805419 0.4862978 0.2345105 -0.0320194 0.1702798 0.3234361 -0.0813731 0.2415251 0.0417367 0.113308 -0.1615043 -0.151301 0.028364 0.0475369 -0.0155059 -0.0359499 -0.0547452 -0.0467256 -0.0598864 -0.2747541 0.1659341 -0.0670849 0.1949672 -0.1420558 -0.0163146 -0.029638 -0.0349021 -0.1406267 0.0005012 -0.0712957 -0.0033841 -0.1208687 -0.0129883 -0.0610004 0.0326257 -0.0480109 -0.1193627 -0.0094566 0.0565446 -0.0449967 -0.1268754 -0.0569167 -0.0322807 0.0361199 -0.0316208 -0.111308 -0.1124278 -0.0147275 0.0002353 0.048015 0.1102284 -0.1006182 -0.0201416 -0.0967159 -0.0973129 1.8920498 -0.2554631 0.1134409 -0.4425475 1.5850653 -0.0146009 0.2096106 -0.0287703 1.5476982 -0.0990269 0.0881699 0.0563968 0.0891745 -0.1575117 -0.0280077 0.0459851 -0.024714 -0.0165397 -0.00569 0.0529057 0.0763093 0.0499937 -0.0056185 -0.0815202 0.0713944 -0.0224005 0.029555 0.0130201 -0.0053736 -0.0350801 -0.0200707 -0.1262974 0.1557509 -0.0236435 0.1048706 -0.0355104 0.176907 0.0185302 0.0037813 0.0152593 0.0566528 0.0332336 -0.0123982 0.0323334 0.1351805 -0.0544405 0.1048203 -0.021514 0.0904882 0.0550341 0.0343843 -0.0209727 0.0285954 0.1278778 -0.006905 -0.0511186 0.0324575 -0.0452595 0.1012296 0.0272627 0.0293675 0.0292078 0.1499469 0.0729721 -0.0200118 0.011519 -0.0201015 -0.0720564 0.0923046 0.0193544 0.0968396 0.1178331 0.3460144 -0.0110384 0.0828515 0.0403946 0.283816 0.0278026 0.0815352 -0.0020783 0.4487065 0.109564 -0.068431 0.0036538 -0.0255458 0.2157228 -0.0842146 -0.0293329 -0.1497186 0.1743082 0.0813005 0.0205527 0.0409723 0.0764857 0.1324545 -0.0539751 0.0030702 -0.038493 0.3060855 unknown
polarizability: 139.9637533|6.8249602|108.6382834|1.6563055|-15.7774477|72.5988382 unknown
InChI: InChI=1S/C9H10F3NO/c10-9(11,12)7-3-1-2-6(4-7)8(14)5-13/h1-4,8,14H,5,13H2
charge 0 multiplicity 1
24 atoms
F  3.796418 -0.118338 -0.078325
F  2.790291 -0.825837 1.826071
F  2.46075 -1.953548 -0.106335
O  -2.368841 -1.157599 1.327121
N  -4.268557 -1.354572 -0.531726
C  -2.427805 -0.020094 0.424305
C  -1.03296 0.521953 0.161586
C  -3.112968 -0.50475 -0.901115
C  0.10283 -0.274147 0.423859
C  1.39305 0.220964 0.122653
C  -0.859789 1.818891 -0.38523
C  1.567716 1.508645 -0.433502
C  0.430714 2.306564 -0.68462
C  2.583197 -0.641577 0.429407
H  -3.054851 0.788739 0.866638
H  -2.391923 -1.131605 -1.455301
H  -3.370888 0.365341 -1.539869
H  -0.046338 -1.260393 0.872973
H  -1.734931 2.455126 -0.568086
H  2.57155 1.878702 -0.660887
H  0.55418 3.309242 -1.106769
H  -3.183261 -1.696067 1.063673
H  -4.453346 -2.135764 -1.165811
H  -5.123839 -0.840977 -0.29611
