program: Orca
programVersion: 4.2.1
elementType: Cl O N N N C C C C C C C C C C C C C C C C C H H H H H H H H H H H H H H H H H H H H H H
charge: 0
multiplicity: 1
keywords: wb97x-d3
keywords: def2-TZVPP
keywords: def2/J RIJCOSX GRIDX6 NOFINALGRIDX
keywords: grid4 nofinalgrid
keywords: scfconv7
keywords: smallprint printgap noloewdin
keywords: NOSOSCF
formula: C17H22ClN3O
InChI: InChI=1S/C17H22ClN3O/c1-16(2)8-7-14(9-13-3-5-15(18)6-4-13)17(16,22)10-21-12-19-11-20-21/h3-6,11-12,14,22H,7-10H2,1-2H3
44 atoms
Cl 4.599033 3.818567 0.980208
O  -2.260332 -1.318623 1.390042
N  -1.155113 -2.814451 -0.874707
N  -0.260158 -2.957954 -1.856944
N  0.174953 -4.396886 -0.194427
C  -2.195729 -0.73093 0.11035
C  -3.360969 0.273805 -0.184656
C  -0.965937 0.192862 0.061736
C  -2.764754 1.152296 -1.301851
C  -1.232497 1.10308 -1.139104
C  -2.221109 -1.836935 -0.960797
C  0.429402 -0.434853 0.081211
C  -3.668191 1.121961 1.054658
C  -4.672747 -0.380671 -0.615861
C  1.485236 0.611823 0.30478
C  -0.884338 -3.679538 0.10249
C  1.738333 1.107241 1.58223
C  2.216125 1.135009 -0.757834
C  2.690477 2.091097 1.800451
C  3.172537 2.121373 -0.562214
C  0.514387 -3.908605 -1.400826
C  3.401339 2.591197 0.720371
H  -1.033785 0.799769 0.970524
H  -3.156121 2.169161 -1.245789
H  -3.054091 0.76817 -2.282526
H  -0.764038 0.693032 -2.03774
H  -0.79805 2.091432 -0.990784
H  -2.174705 -1.421766 -1.965918
H  -3.163536 -2.381353 -0.888383
H  0.637315 -0.945024 -0.858892
H  0.491028 -1.181508 0.877428
H  -4.402569 1.884987 0.791304
H  -4.099329 0.527018 1.861174
H  -2.799744 1.644461 1.455671
H  -5.038667 -1.096752 0.125385
H  -5.446506 0.381424 -0.725642
H  -4.603159 -0.895414 -1.57437
H  -3.100558 -1.782756 1.484113
H  -1.480568 -3.775085 0.993825
H  1.188054 0.715344 2.429475
H  2.043531 0.767331 -1.762101
H  2.876794 2.4576 2.800844
H  3.731278 2.512578 -1.401516
H  1.357079 -4.270657 -1.968661
elementType: Cl O N C H
totalener: -1360.83973575 hartree
nucrepener: 1982.44008758 hartree
electener: -3343.27982333 hartree
oneelecener: -5797.22484987 hartree
twoeener: 2453.94502654 hartree
cpcmener: -0.03320289 hartree
kineticenergy: 1356.14782794 hartree
xcener: -110.262714793582 hartree
chargesum: 0.0000000
charge: -0.108178 -0.428238 0.136386 -0.362691 -0.414597 0.429006 0.199206 -0.067775 -0.259730 -0.201046 -0.235386 -0.107554 -0.356392 -0.336509 0.032512 0.074741 -0.224955 -0.220377 -0.171715 -0.158778 0.058803 0.101677 0.093397 0.081232 0.090296 0.085852 0.088547 0.124233 0.147874 0.086482 0.112190 0.098874 0.092572 0.105840 0.097358 0.106729 0.090057 0.224118 0.161386 0.143449 0.137116 0.145433 0.144345 0.164209
qa: -0.1082 -0.4282 0.1364 -0.3627 -0.4146 0.4290 0.1992 -0.0678 -0.2597 -0.2010 -0.2354 -0.1076 -0.3564 -0.3365 0.0325 0.0747 -0.2250 -0.2204 -0.1717 -0.1588 0.0588 0.1017 0.0934 0.0812 0.0903 0.0859 0.0885 0.1242 0.1479 0.0865 0.1122 0.0989 0.0926 0.1058 0.0974 0.1067 0.0901 0.2241 0.1614 0.1434 0.1371 0.1454 0.1443 0.1642
va: 1.1971 2.0175 3.3619 2.8647 3.0379 3.8054 3.7931 3.8149 4.0024 3.9074 3.9576 3.7652 3.9463 3.9219 3.5384 4.0525 3.9884 3.9708 3.9999 4.0010 4.0356 3.8044 1.0228 1.0123 1.0060 1.0087 1.0057 1.0049 0.9845 1.0328 1.0229 1.0045 1.0102 0.9977 1.0044 1.0021 0.9996 1.0107 1.0158 1.0059 1.0074 1.0052 1.0057 0.9958
dispcorr: -0.025518618 hartree
energy: -1360.865254366856
dipole: -37.01069 34.02521 -2.98548 -5.63223 5.90655 0.27432 -4.90880 4.64921 -0.25959
magnitude: 3.00927 au
magnitude: 7.64896 debye
