program: Orca
programVersion: 4.2.1
elementType: Cl O N N N C C C C C C C C C C C C C C C C C H H H H H H H H H H H H H H H H H H H H H H
charge: 0
multiplicity: 1
keywords: wb97x-d3
keywords: def2-TZVPP
keywords: def2/J RIJCOSX GRIDX6 NOFINALGRIDX
keywords: grid4 nofinalgrid
keywords: scfconv7
keywords: smallprint printgap noloewdin
keywords: NOSOSCF
formula: C17H22ClN3O
InChI: InChI=1S/C17H22ClN3O/c1-16(2)8-7-14(9-13-3-5-15(18)6-4-13)17(16,22)10-21-12-19-11-20-21/h3-6,11-12,14,22H,7-10H2,1-2H3
44 atoms
Cl 4.778702 3.413541 1.294895
O  -2.635066 -1.456883 1.166993
N  -1.04502 -2.834227 -0.88025
N  -0.86724 -3.392991 0.321101
N  0.622106 -4.208877 -1.134994
C  -2.212471 -0.799093 -0.014756
C  -3.322117 0.242528 -0.336551
C  -0.942265 0.05264 0.315423
C  -3.005648 1.333653 0.692867
C  -1.484952 1.457208 0.667955
C  -2.061483 -1.828475 -1.138842
C  0.166151 0.121183 -0.745792
C  -4.738952 -0.300431 -0.180313
C  -3.186298 0.807216 -1.754228
C  1.330191 0.942068 -0.264072
C  -0.149404 -3.328913 -1.731312
C  1.586121 2.211688 -0.771139
C  2.172267 0.450785 0.732257
C  2.643398 2.978848 -0.300669
C  3.232121 1.200001 1.216875
C  0.140464 -4.205182 0.118278
C  3.456883 2.464961 0.694587
H  -0.491371 -0.394891 1.205508
H  -3.35411 1.026443 1.68143
H  -3.507093 2.274769 0.457779
H  -1.185716 2.179461 -0.095759
H  -1.081535 1.828339 1.610086
H  -1.787236 -1.359158 -2.080978
H  -3.016909 -2.334121 -1.294978
H  -0.21383 0.546003 -1.677278
H  0.53262 -0.877744 -0.98709
H  -4.934959 -1.137629 -0.854445
H  -4.952252 -0.629356 0.835234
H  -5.461573 0.479936 -0.428559
H  -2.186292 1.168823 -1.994874
H  -3.458569 0.072621 -2.514342
H  -3.866232 1.652215 -1.875638
H  -1.999936 -2.167487 1.347138
H  -0.093355 -3.023421 -2.764265
H  0.955344 2.616873 -1.552769
H  2.005016 -0.538855 1.141223
H  2.824893 3.96382 -0.708679
H  3.873494 0.800285 1.990557
H  0.541108 -4.816883 0.910879
elementType: Cl O N C H
totalener: -1360.84148603 hartree
nucrepener: 1985.05093165 hartree
electener: -3345.89241769 hartree
oneelecener: -5802.21941498 hartree
twoeener: 2456.32699730 hartree
cpcmener: -0.03000215 hartree
kineticenergy: 1356.15706536 hartree
xcener: -110.267295784363 hartree
chargesum: 0.0000000
charge: -0.107513 -0.486338 0.127311 -0.382659 -0.411883 0.458172 0.275044 -0.147251 -0.270350 -0.167921 -0.214129 -0.115122 -0.346246 -0.397286 0.029147 0.059278 -0.209530 -0.218910 -0.168655 -0.169857 0.082676 0.107060 0.082645 0.087230 0.083827 0.086860 0.085496 0.129325 0.147248 0.120143 0.105908 0.092590 0.091132 0.102167 0.111510 0.101258 0.101836 0.223435 0.182591 0.143966 0.139886 0.144810 0.144656 0.166440
qa: -0.1075 -0.4863 0.1273 -0.3827 -0.4119 0.4582 0.2750 -0.1473 -0.2703 -0.1679 -0.2141 -0.1151 -0.3462 -0.3973 0.0291 0.0593 -0.2095 -0.2189 -0.1687 -0.1699 0.0827 0.1071 0.0826 0.0872 0.0838 0.0869 0.0855 0.1293 0.1472 0.1201 0.1059 0.0926 0.0911 0.1022 0.1115 0.1013 0.1018 0.2234 0.1826 0.1440 0.1399 0.1448 0.1447 0.1664
va: 1.1976 1.9607 3.3143 2.8628 3.0220 3.7171 3.6454 3.9529 3.9950 3.9027 3.9595 3.7566 3.9429 3.9479 3.5436 4.0439 3.9719 3.9809 4.0083 4.0137 4.0085 3.8036 1.0373 1.0221 1.0199 1.0043 1.0131 0.9879 0.9945 0.9980 1.0242 1.0040 1.0190 1.0001 1.0007 0.9962 1.0059 1.0643 0.9902 1.0049 1.0071 1.0057 1.0060 0.9924
dispcorr: -0.025398117 hartree
energy: -1360.866884151018
dipole: -35.50158 34.37678 -1.12480 -3.32368 3.67862 0.35495 -8.87758 7.20958 -1.66800
magnitude: 2.04289 au
magnitude: 5.19261 debye
